BDBM50408974 CHEMBL317446
SMILES: CC(C)(C)OC(=O)N[C@@H](Cc1ccccc1)[C@@H](O)C[C@@H](Cc1ccccc1)C(=O)N[C@H]1[C@H](O)CCc2ccccc12
InChI Key: InChIKey=IMGCDQHXXAQTBJ-UADDYFSRSA-N
Data: 1 IC50
Activity Spreadsheet -- Enzyme Inhibition Constant Data from BindingDB
Found 1 hit for monomerid = 50408974
Trg + Lig
Ki
nM
ΔG°
kcal/mole
IC50
nM
Kd
nM
EC50/IC50
nM
koff
s-1
kon
M-1s-1
pHTemp
°C
Human immunodeficiency virus type 1 protease
(Human immunodeficiency virus type 1)
BDBM50408974
(CHEMBL317446)
Show SMILES CC(C)(C)OC(=O)N[C@@H](Cc1ccccc1)[C@@H](O)C[C@@H](Cc1ccccc1)C(=O)N[C@H]1[C@H](O)CCc2ccccc12
Show InChI InChI=1S/C34H42N2O5/c1-34(2,3)41-33(40)35-28(21-24-14-8-5-9-15-24)30(38)22-26(20-23-12-6-4-7-13-23)32(39)36-31-27-17-11-10-16-25(27)18-19-29(31)37/h4-17,26,28-31,37-38H,18-22H2,1-3H3,(H,35,40)(H,36,39)/t26-,28+,29-,30+,31-/m1/s1
n/an/a 0.700n/an/an/an/an/an/a
Eli Lilly and Company
Curated by ChEMBL
Assay Description
Inhibitory activity against HIV-1 protease.
J Med Chem 43: 3020-32 (2000)
BindingDB Entry DOI: 10.7270/Q2HM59P2