BDBM50408979 CHEMBL103400
SMILES: CC(C)(C)OC(=O)N[C@@H](Cc1ccccc1)[C@@H](O)C[C@@H](Cc1ccccc1)C(=O)N[C@H]1[C@H](O)[C@H](O)c2ccccc12
InChI Key: InChIKey=HKAQGSPFDKETKG-NALFRMBBSA-N
Data: 1 IC50
Activity Spreadsheet -- Enzyme Inhibition Constant Data from BindingDB
Found 1 hit for monomerid = 50408979
Trg + Lig
Ki
nM
ΔG°
kcal/mole
IC50
nM
Kd
nM
EC50/IC50
nM
koff
s-1
kon
M-1s-1
pHTemp
°C
Human immunodeficiency virus type 1 protease
(Human immunodeficiency virus type 1)
BDBM50408979
(CHEMBL103400)
Show SMILES CC(C)(C)OC(=O)N[C@@H](Cc1ccccc1)[C@@H](O)C[C@@H](Cc1ccccc1)C(=O)N[C@H]1[C@H](O)[C@H](O)c2ccccc12
Show InChI InChI=1S/C33H40N2O6/c1-33(2,3)41-32(40)34-26(19-22-14-8-5-9-15-22)27(36)20-23(18-21-12-6-4-7-13-21)31(39)35-28-24-16-10-11-17-25(24)29(37)30(28)38/h4-17,23,26-30,36-38H,18-20H2,1-3H3,(H,34,40)(H,35,39)/t23-,26+,27+,28-,29-,30+/m1/s1
n/an/a 0.100n/an/an/an/an/an/a
Eli Lilly and Company
Curated by ChEMBL
Assay Description
Inhibitory activity against HIV-1 protease.
J Med Chem 43: 3020-32 (2000)
BindingDB Entry DOI: 10.7270/Q2HM59P2