BDBM50408986 CHEMBL318003
SMILES: CC(C)(C)OC(=O)N[C@@H](Cc1ccccc1)[C@@H](O)C[C@@H](Cc1ccccc1)C(=O)N[C@H]1[C@H](O)Cc2ccccc12
InChI Key: InChIKey=ZJBUCZFZQXPYFC-AARHSHDHSA-N
Data: 1 IC50
Activity Spreadsheet -- Enzyme Inhibition Constant Data from BindingDB
Found 1 hit for monomerid = 50408986
Trg + Lig
Ki
nM
ΔG°
kcal/mole
IC50
nM
Kd
nM
EC50/IC50
nM
koff
s-1
kon
M-1s-1
pHTemp
°C
Human immunodeficiency virus type 1 protease
(Human immunodeficiency virus type 1)
BDBM50408986
(CHEMBL318003)
Show SMILES CC(C)(C)OC(=O)N[C@@H](Cc1ccccc1)[C@@H](O)C[C@@H](Cc1ccccc1)C(=O)N[C@H]1[C@H](O)Cc2ccccc12
Show InChI InChI=1S/C33H40N2O5/c1-33(2,3)40-32(39)34-27(19-23-14-8-5-9-15-23)28(36)21-25(18-22-12-6-4-7-13-22)31(38)35-30-26-17-11-10-16-24(26)20-29(30)37/h4-17,25,27-30,36-37H,18-21H2,1-3H3,(H,34,39)(H,35,38)/t25-,27+,28+,29-,30-/m1/s1
n/an/a 0.250n/an/an/an/an/an/a
Eli Lilly and Company
Curated by ChEMBL
Assay Description
Inhibitory activity against HIV-1 protease.
J Med Chem 43: 3020-32 (2000)
BindingDB Entry DOI: 10.7270/Q2HM59P2