BDBM50409117 CHEMBL2093045
SMILES: C\C(=N/O[C@@H](C1CCCCC1)c1ccc(OCc2ccc3ccccc3n2)cc1)C(O)=O
InChI Key: InChIKey=USBHSZPRMPADOE-QMFOPCRCSA-N
Data: 1 IC50
Activity Spreadsheet -- Enzyme Inhibition Constant Data from BindingDB
Found 1 hit for monomerid = 50409117
Trg + Lig
Ki
nM
ΔG°
kcal/mole
IC50
nM
Kd
nM
EC50/IC50
nM
koff
s-1
kon
M-1s-1
pHTemp
°C
Arachidonate 5-lipoxygenase
(Homo sapiens (Human))
BDBM50409117
(CHEMBL2093045)
Show SMILES C\C(=N/O[C@@H](C1CCCCC1)c1ccc(OCc2ccc3ccccc3n2)cc1)C(O)=O |r|
Show InChI InChI=1S/C26H28N2O4/c1-18(26(29)30)28-32-25(20-8-3-2-4-9-20)21-12-15-23(16-13-21)31-17-22-14-11-19-7-5-6-10-24(19)27-22/h5-7,10-16,20,25H,2-4,8-9,17H2,1H3,(H,29,30)/b28-18+/t25-/m0/s1
Reactome pathway
n/an/a 8n/an/an/an/an/an/a
Abbott Laboratories
Curated by ChEMBL
Assay Description
Inhibition of calcium ionophore (A-23187)-stimulated LTB4 formation in human neutrophil assay
J Med Chem 43: 690-705 (2000)
BindingDB Entry DOI: 10.7270/Q2HD7WCR