BDBM50409190 CHEMBL11879
SMILES: C(Cc1ncc(CCN2CCCC2)[nH]1)C(c1ccccc1)c1ccccc1
InChI Key: InChIKey=HKZSTMPUPMSPLU-UHFFFAOYSA-N
Data: 1 Kd
Activity Spreadsheet -- Enzyme Inhibition Constant Data from BindingDB
Found 1 hit for monomerid = 50409190
Trg + Lig
Ki
nM
ΔG°
kcal/mole
IC50
nM
Kd
nM
EC50/IC50
nM
koff
s-1
kon
M-1s-1
pHTemp
°C
Histamine H1 receptor
(Cavia porcellus (domestic guinea pig))
BDBM50409190
(CHEMBL11879)
Show SMILES C(Cc1ncc(CCN2CCCC2)[nH]1)C(c1ccccc1)c1ccccc1
Show InChI InChI=1S/C24H29N3/c1-3-9-20(10-4-1)23(21-11-5-2-6-12-21)13-14-24-25-19-22(26-24)15-18-27-16-7-8-17-27/h1-6,9-12,19,23H,7-8,13-18H2,(H,25,26)
n/an/an/a 0.955n/an/an/an/an/a
Freie Universit£t Berlin
Curated by ChEMBL
Assay Description
Compound was evaluated for mepyramine antagonism effects in guinea pig ileum (contraction) at a mepyramine concentration of 100 nM; value ranges from...
J Med Chem 43: 1071-84 (2000)
BindingDB Entry DOI: 10.7270/Q2MC918D