BDBM50409470 CHEMBL32532
SMILES: C[C@H](NCCc1ccc(NCC(O)=O)cc1)[C@H](O)c1ccc(O)cc1
InChI Key: InChIKey=RKKYADBLVYWPJP-DJJJIMSYSA-N
Data: 1 IC50  1 EC50
Activity Spreadsheet -- Enzyme Inhibition Constant Data from BindingDB
Found 2 hits for monomerid = 50409470
Trg + Lig
Ki
nM
ΔG°
kcal/mole
IC50
nM
Kd
nM
EC50/IC50
nM
koff
s-1
kon
M-1s-1
pHTemp
°C
Adrenergic receptor beta
(Rattus norvegicus)
BDBM50409470
(CHEMBL32532)
Show SMILES C[C@H](NCCc1ccc(NCC(O)=O)cc1)[C@H](O)c1ccc(O)cc1
Show InChI InChI=1S/C19H24N2O4/c1-13(19(25)15-4-8-17(22)9-5-15)20-11-10-14-2-6-16(7-3-14)21-12-18(23)24/h2-9,13,19-22,25H,10-12H2,1H3,(H,23,24)/t13-,19-/m0/s1
Reactome pathway
n/an/an/an/a 24.0n/an/an/an/a
Kissei Pharmaceutical Company Ltd.
Curated by ChEMBL
Assay Description
Agonistic activity towards beta-3 adrenoceptor. Mean concentration required to produce 50% relaxation of detrusor before the addition in the ferret d...
J Med Chem 44: 1436-45 (2001)
BindingDB Entry DOI: 10.7270/Q2Q52QVH
Beta-2 adrenergic receptor
(Rattus norvegicus)
BDBM50409470
(CHEMBL32532)
Show SMILES C[C@H](NCCc1ccc(NCC(O)=O)cc1)[C@H](O)c1ccc(O)cc1
Show InChI InChI=1S/C19H24N2O4/c1-13(19(25)15-4-8-17(22)9-5-15)20-11-10-14-2-6-16(7-3-14)21-12-18(23)24/h2-9,13,19-22,25H,10-12H2,1H3,(H,23,24)/t13-,19-/m0/s1
n/an/a 646n/an/an/an/an/an/a
Kissei Pharmaceutical Company Ltd.
Curated by ChEMBL
Assay Description
Agonistic activity towards beta-2 adrenoceptor. Mean concentration required to produce 50% inhibition of uterine contraction
J Med Chem 44: 1436-45 (2001)
BindingDB Entry DOI: 10.7270/Q2Q52QVH