null
SMILES: CC#CC1=C(N)C2(OS1(=O)=O)C(CO[Si](C)(C)C(C)(C)C)OC(C2O[Si](C)(C)C(C)(C)C)n1cc(C)c(=O)n(C)c1=O
InChI Key: InChIKey=GBCIJBJNVOHBEI-UHFFFAOYSA-N
Activity Spreadsheet -- Enzyme Inhibition Constant Data from BindingDB
Found 2 hits for monomerid = 50409557
Trg + Lig
Ki
nM
ΔG°
kcal/mole
IC50
nM
Kd
nM
EC50/IC50
nM
koff
s-1
kon
M-1s-1
pHTemp
°C
Reverse transcriptase/RNaseH
(Human immunodeficiency virus 1)
BDBM50409557
(CHEMBL129381)
Show SMILES CC#CC1=C(N)C2(OS1(=O)=O)C(CO[Si](C)(C)C(C)(C)C)OC(C2O[Si](C)(C)C(C)(C)C)n1cc(C)c(=O)n(C)c1=O |c:3|
Show InChI InChI=1S/C28H47N3O8SSi2/c1-14-15-19-21(29)28(39-40(19,34)35)20(17-36-41(10,11)26(3,4)5)37-24(22(28)38-42(12,13)27(6,7)8)31-16-18(2)23(32)30(9)25(31)33/h16,20,22,24H,17,29H2,1-13H3
n/an/an/an/a>2.00E+3n/an/an/an/a
Instituto de Qu£mica M£dica (C.S.I.C.)
Curated by ChEMBL
Assay Description
Effective concentration required to inhibit HIV-1 induced cytopathicity in MT-4 cell culture by 50%.
J Med Chem 45: 3934-45 (2002)
BindingDB Entry DOI: 10.7270/Q2639QXQ
Reverse transcriptase/RNaseH
(Human immunodeficiency virus 1)
BDBM50409557
(CHEMBL129381)
Show SMILES CC#CC1=C(N)C2(OS1(=O)=O)C(CO[Si](C)(C)C(C)(C)C)OC(C2O[Si](C)(C)C(C)(C)C)n1cc(C)c(=O)n(C)c1=O |c:3|
Show InChI InChI=1S/C28H47N3O8SSi2/c1-14-15-19-21(29)28(39-40(19,34)35)20(17-36-41(10,11)26(3,4)5)37-24(22(28)38-42(12,13)27(6,7)8)31-16-18(2)23(32)30(9)25(31)33/h16,20,22,24H,17,29H2,1-13H3
n/an/an/an/a>2.00E+3n/an/an/an/a
Instituto de Qu£mica M£dica (C.S.I.C.)
Curated by ChEMBL
Assay Description
Effective concentration required to inhibit HIV-1 induced cytopathicity in CEM cell culture by 50%.
J Med Chem 45: 3934-45 (2002)
BindingDB Entry DOI: 10.7270/Q2639QXQ