BDBM50409655 CHEMBL152577
SMILES: CCCCCCS(=O)(=O)CC(C)=O
InChI Key: InChIKey=FIMACEIKKPQUFZ-UHFFFAOYSA-N
Data: 4 IC50
Activity Spreadsheet -- Enzyme Inhibition Constant Data from BindingDB
Found 4 hits for monomerid = 50409655
Trg + Lig
Ki
nM
ΔG°
kcal/mole
IC50
nM
Kd
nM
EC50/IC50
nM
koff
s-1
kon
M-1s-1
pHTemp
°C
Carboxylesterase
(Sus scrofa)
BDBM50409655
(CHEMBL152577)
Show SMILES CCCCCCS(=O)(=O)CC(C)=O
Show InChI InChI=1S/C9H18O3S/c1-3-4-5-6-7-13(11,12)8-9(2)10/h3-8H2,1-2H3
n/an/a 1.10E+5n/an/an/an/an/an/a
University of California
Curated by ChEMBL
Assay Description
In vitro inhibition of porcine carboxylesterase.
J Med Chem 45: 5576-93 (2002)
BindingDB Entry DOI: 10.7270/Q2DN4671
Carboxylesterase 2
(Mus musculus)
BDBM50409655
(CHEMBL152577)
Show SMILES CCCCCCS(=O)(=O)CC(C)=O
Show InChI InChI=1S/C9H18O3S/c1-3-4-5-6-7-13(11,12)8-9(2)10/h3-8H2,1-2H3
n/an/a 4.79E+5n/an/an/an/an/an/a
University of California
Curated by ChEMBL
Assay Description
Inhibition of carboxylesterase in murine liver microsomes.
J Med Chem 45: 5576-93 (2002)
BindingDB Entry DOI: 10.7270/Q2DN4671
Carboxylesterase 2
(Homo sapiens (Human))
BDBM50409655
(CHEMBL152577)
Show SMILES CCCCCCS(=O)(=O)CC(C)=O
Show InChI InChI=1S/C9H18O3S/c1-3-4-5-6-7-13(11,12)8-9(2)10/h3-8H2,1-2H3
NCI pathway
n/an/a 1.05E+5n/an/an/an/an/an/a
University of California
Curated by ChEMBL
Assay Description
In vitro inhibition of carboxylesterase in human liver microsomes.
J Med Chem 45: 5576-93 (2002)
BindingDB Entry DOI: 10.7270/Q2DN4671
CG8425-PA [Drosophila melanogaster]
(Drosophila melanogaster)
BDBM50409655
(CHEMBL152577)
Show SMILES CCCCCCS(=O)(=O)CC(C)=O
Show InChI InChI=1S/C9H18O3S/c1-3-4-5-6-7-13(11,12)8-9(2)10/h3-8H2,1-2H3
n/an/a 5.13E+5n/an/an/an/an/an/a
University of California
Curated by ChEMBL
Assay Description
In vitro inhibition of Trichoplusia Juvenile Hormone Esterase.
J Med Chem 45: 5576-93 (2002)
BindingDB Entry DOI: 10.7270/Q2DN4671