BDBM50409661 CHEMBL152843
SMILES: CCCCCCCCC(=O)C(F)(F)F
InChI Key: InChIKey=OQHGRUHRHLFMBX-UHFFFAOYSA-N
Data: 4 IC50
Activity Spreadsheet -- Enzyme Inhibition Constant Data from BindingDB
Found 4 hits for monomerid = 50409661
Trg + Lig
Ki
nM
ΔG°
kcal/mole
IC50
nM
Kd
nM
EC50/IC50
nM
koff
s-1
kon
M-1s-1
pHTemp
°C
CG8425-PA [Drosophila melanogaster]
(Drosophila melanogaster)
BDBM50409661
(CHEMBL152843)
Show SMILES CCCCCCCCC(=O)C(F)(F)F
Show InChI InChI=1S/C10H17F3O/c1-2-3-4-5-6-7-8-9(14)10(11,12)13/h2-8H2,1H3
n/an/a 6.76E+3n/an/an/an/an/an/a
University of California
Curated by ChEMBL
Assay Description
In vitro inhibition of Trichoplusia Juvenile Hormone Esterase.
J Med Chem 45: 5576-93 (2002)
BindingDB Entry DOI: 10.7270/Q2DN4671
Carboxylesterase 2
(Homo sapiens (Human))
BDBM50409661
(CHEMBL152843)
Show SMILES CCCCCCCCC(=O)C(F)(F)F
Show InChI InChI=1S/C10H17F3O/c1-2-3-4-5-6-7-8-9(14)10(11,12)13/h2-8H2,1H3
NCI pathway
n/an/a 4.37E+3n/an/an/an/an/an/a
University of California
Curated by ChEMBL
Assay Description
In vitro inhibition of carboxylesterase in human liver microsomes.
J Med Chem 45: 5576-93 (2002)
BindingDB Entry DOI: 10.7270/Q2DN4671
Carboxylesterase
(Sus scrofa)
BDBM50409661
(CHEMBL152843)
Show SMILES CCCCCCCCC(=O)C(F)(F)F
Show InChI InChI=1S/C10H17F3O/c1-2-3-4-5-6-7-8-9(14)10(11,12)13/h2-8H2,1H3
n/an/a 2.14E+4n/an/an/an/an/an/a
University of California
Curated by ChEMBL
Assay Description
In vitro inhibition of porcine carboxylesterase.
J Med Chem 45: 5576-93 (2002)
BindingDB Entry DOI: 10.7270/Q2DN4671
Carboxylesterase 2
(Mus musculus)
BDBM50409661
(CHEMBL152843)
Show SMILES CCCCCCCCC(=O)C(F)(F)F
Show InChI InChI=1S/C10H17F3O/c1-2-3-4-5-6-7-8-9(14)10(11,12)13/h2-8H2,1H3
n/an/a 3.80E+4n/an/an/an/an/an/a
University of California
Curated by ChEMBL
Assay Description
Inhibition of carboxylesterase in murine liver microsomes.
J Med Chem 45: 5576-93 (2002)
BindingDB Entry DOI: 10.7270/Q2DN4671