BDBM50409728 CHEMBL337942
SMILES: CN(C)CCOc1ccc(CN2CCCCC2)cc1
InChI Key: InChIKey=ZXZGSTIBDLJCKH-UHFFFAOYSA-N
Data: 1 Kd
Activity Spreadsheet -- Enzyme Inhibition Constant Data from BindingDB
Found 1 hit for monomerid = 50409728
Trg + Lig
Ki
nM
ΔG°
kcal/mole
IC50
nM
Kd
nM
EC50/IC50
nM
koff
s-1
kon
M-1s-1
pHTemp
°C
Histamine H3 receptor
(Homo sapiens (Human))
BDBM50409728
(CHEMBL337942)
Show SMILES CN(C)CCOc1ccc(CN2CCCCC2)cc1
Show InChI InChI=1S/C16H26N2O/c1-17(2)12-13-19-16-8-6-15(7-9-16)14-18-10-4-3-5-11-18/h6-9H,3-5,10-14H2,1-2H3
Reactome pathway
n/an/an/a 10.5n/an/an/an/an/a
Johnson& Johnson Pharmaceutical Research& Development
Curated by ChEMBL
Assay Description
Histamine-induced inhibition of forskolin- stimulated cAMP accumulation in SK-N-MC cells overexpressing the human Histamine H3 receptor
J Med Chem 46: 3938-44 (2003)
Article DOI: 10.1021/jm030185v
BindingDB Entry DOI: 10.7270/Q2WQ051F