BDBM50409730 CHEMBL339867
SMILES: C(COc1ccc(CN2CCOCC2)cc1)CN1CCCCC1
InChI Key: InChIKey=SWBLVOLQPQNGMO-UHFFFAOYSA-N
Data: 1 Kd
Activity Spreadsheet -- Enzyme Inhibition Constant Data from BindingDB
Found 1 hit for monomerid = 50409730
Trg + Lig
Ki
nM
ΔG°
kcal/mole
IC50
nM
Kd
nM
EC50/IC50
nM
koff
s-1
kon
M-1s-1
pHTemp
°C
Histamine H3 receptor
(Homo sapiens (Human))
BDBM50409730
(CHEMBL339867)
Show SMILES C(COc1ccc(CN2CCOCC2)cc1)CN1CCCCC1
Show InChI InChI=1S/C19H30N2O2/c1-2-9-20(10-3-1)11-4-14-23-19-7-5-18(6-8-19)17-21-12-15-22-16-13-21/h5-8H,1-4,9-17H2
Reactome pathway
n/an/an/a 0.537n/an/an/an/an/a
Johnson& Johnson Pharmaceutical Research& Development
Curated by ChEMBL
Assay Description
Histamine-induced inhibition of forskolin- stimulated cAMP accumulation in SK-N-MC cells overexpressing the human Histamine H3 receptor
J Med Chem 46: 3938-44 (2003)
Article DOI: 10.1021/jm030185v
BindingDB Entry DOI: 10.7270/Q2WQ051F