BDBM50409787 CHEMBL16377
SMILES: CC(=O)c1c(O)n(O)c2cc(NC(=O)c3ccc4ccccc4c3)ccc12
InChI Key: InChIKey=ZTZXYRRDBCFZQC-UHFFFAOYSA-N
Data: 2 IC50
Activity Spreadsheet -- Enzyme Inhibition Constant Data from BindingDB
Found 2 hits for monomerid = 50409787
Trg + Lig
Ki
nM
ΔG°
kcal/mole
IC50
nM
Kd
nM
EC50/IC50
nM
koff
s-1
kon
M-1s-1
pHTemp
°C
PA/PB1
(Hepatitis C virus)
BDBM50409787
(CHEMBL16377)
Show SMILES CC(=O)c1c(O)n(O)c2cc(NC(=O)c3ccc4ccccc4c3)ccc12
Show InChI InChI=1S/C21H16N2O4/c1-12(24)19-17-9-8-16(11-18(17)23(27)21(19)26)22-20(25)15-7-6-13-4-2-3-5-14(13)10-15/h2-11,26-27H,1H3,(H,22,25)
n/an/a 9.00E+3n/an/an/an/an/an/a
Roche Discovery Welwyn
Curated by ChEMBL
Assay Description
Inhibitory concentration against cap-dependent endonuclease activity of influenza A/PR/8/34 RNP
J Med Chem 46: 1153-64 (2003)
Article DOI: 10.1021/jm020334u
BindingDB Entry DOI: 10.7270/Q22J6B6V
Polymerase acidic protein
(Influenza B virus (B/Lee/40))
BDBM50409787
(CHEMBL16377)
Show SMILES CC(=O)c1c(O)n(O)c2cc(NC(=O)c3ccc4ccccc4c3)ccc12
Show InChI InChI=1S/C21H16N2O4/c1-12(24)19-17-9-8-16(11-18(17)23(27)21(19)26)22-20(25)15-7-6-13-4-2-3-5-14(13)10-15/h2-11,26-27H,1H3,(H,22,25)
n/an/a 1.80E+4n/an/an/an/an/an/a
Roche Discovery Welwyn
Curated by ChEMBL
Assay Description
Inhibitory concentration against cap-dependent endonuclease activity of influenza B/Lee/40 RNP
J Med Chem 46: 1153-64 (2003)
Article DOI: 10.1021/jm020334u
BindingDB Entry DOI: 10.7270/Q22J6B6V