BDBM50409801 CHEMBL16525
SMILES: OC(=O)c1cccc(NC(=O)Nc2ccc3c(C(=O)c4ccccc4)c(O)n(O)c3c2)c1
InChI Key: InChIKey=QVKWVFCKHMNJEQ-UHFFFAOYSA-N
Data: 3 IC50
Activity Spreadsheet -- Enzyme Inhibition Constant Data from BindingDB
Found 3 hits for monomerid = 50409801
Trg + Lig
Ki
nM
ΔG°
kcal/mole
IC50
nM
Kd
nM
EC50/IC50
nM
koff
s-1
kon
M-1s-1
pHTemp
°C
PA/PB1
(Hepatitis C virus)
BDBM50409801
(CHEMBL16525)
Show SMILES OC(=O)c1cccc(NC(=O)Nc2ccc3c(C(=O)c4ccccc4)c(O)n(O)c3c2)c1
Show InChI InChI=1S/C23H17N3O6/c27-20(13-5-2-1-3-6-13)19-17-10-9-16(12-18(17)26(32)21(19)28)25-23(31)24-15-8-4-7-14(11-15)22(29)30/h1-12,28,32H,(H,29,30)(H2,24,25,31)
n/an/a 3.00E+3n/an/an/an/an/an/a
University of Bayreuth
Curated by ChEMBL
Assay Description
Inhibitory concentration against cap-dependent endonuclease activity of influenza A/PR/8/34 RNP
Bioorg Med Chem 16: 4203-21 (2008)
Article DOI: 10.1016/j.bmc.2008.02.069
BindingDB Entry DOI: 10.7270/Q2C24W6P
PA/PB1
(Hepatitis C virus)
BDBM50409801
(CHEMBL16525)
Show SMILES OC(=O)c1cccc(NC(=O)Nc2ccc3c(C(=O)c4ccccc4)c(O)n(O)c3c2)c1
Show InChI InChI=1S/C23H17N3O6/c27-20(13-5-2-1-3-6-13)19-17-10-9-16(12-18(17)26(32)21(19)28)25-23(31)24-15-8-4-7-14(11-15)22(29)30/h1-12,28,32H,(H,29,30)(H2,24,25,31)
n/an/a 3.00E+3n/an/an/an/an/an/a
Roche Discovery Welwyn
Curated by ChEMBL
Assay Description
Inhibitory concentration against cap-dependent endonuclease activity of influenza A/PR/8/34 RNP
J Med Chem 46: 1153-64 (2003)
Article DOI: 10.1021/jm020334u
BindingDB Entry DOI: 10.7270/Q22J6B6V
Polymerase acidic protein
(Influenza B virus (B/Lee/40))
BDBM50409801
(CHEMBL16525)
Show SMILES OC(=O)c1cccc(NC(=O)Nc2ccc3c(C(=O)c4ccccc4)c(O)n(O)c3c2)c1
Show InChI InChI=1S/C23H17N3O6/c27-20(13-5-2-1-3-6-13)19-17-10-9-16(12-18(17)26(32)21(19)28)25-23(31)24-15-8-4-7-14(11-15)22(29)30/h1-12,28,32H,(H,29,30)(H2,24,25,31)
n/an/a 6.00E+3n/an/an/an/an/an/a
Roche Discovery Welwyn
Curated by ChEMBL
Assay Description
Inhibitory concentration against cap-dependent endonuclease activity of influenza B/Lee/40 RNP
J Med Chem 46: 1153-64 (2003)
Article DOI: 10.1021/jm020334u
BindingDB Entry DOI: 10.7270/Q22J6B6V