null
SMILES: Cc1cc(no1)C(=O)Nc1ccc2c(C(=O)c3ccccc3)c(O)n(O)c2c1
InChI Key: InChIKey=SUZYZAUFEBEJFW-UHFFFAOYSA-N
Activity Spreadsheet -- Enzyme Inhibition Constant Data from BindingDB
Found 1 hit for monomerid = 50409804
Trg + Lig
Ki
nM
ΔG°
kcal/mole
IC50
nM
Kd
nM
EC50/IC50
nM
koff
s-1
kon
M-1s-1
pHTemp
°C
Polymerase acidic protein
(Hepatitis C virus)
BDBM50409804
(CHEMBL16453)
Show SMILES Cc1cc(no1)C(=O)Nc1ccc2c(C(=O)c3ccccc3)c(O)n(O)c2c1
Show InChI InChI=1S/C20H15N3O5/c1-11-9-15(22-28-11)19(25)21-13-7-8-14-16(10-13)23(27)20(26)17(14)18(24)12-5-3-2-4-6-12/h2-10,26-27H,1H3,(H,21,25)
n/an/a 9.50E+3n/an/an/an/an/an/a
Roche Discovery Welwyn
Curated by ChEMBL
Assay Description
Inhibitory concentration against cap-dependent endonuclease activity of influenza A/PR/8/34 RNP
J Med Chem 46: 1153-64 (2003)
Article DOI: 10.1021/jm020334u
BindingDB Entry DOI: 10.7270/Q22J6B6V