BDBM50409989 CHEMBL361941
SMILES: Oc1cc(O)c(cc1Cl)-c1n[nH]cc1-c1ccc(cc1)-c1ccc(F)cc1
InChI Key: InChIKey=VVWDLGJMLGXNMN-UHFFFAOYSA-N
Data: 1 IC50
Activity Spreadsheet -- Enzyme Inhibition Constant Data from BindingDB
Found 1 hit for monomerid = 50409989
Trg + Lig
Ki
nM
ΔG°
kcal/mole
IC50
nM
Kd
nM
EC50/IC50
nM
koff
s-1
kon
M-1s-1
pHTemp
°C
Heat Shock Protein 90 (Hsp90)
(Saccharomyces cerevisiae)
BDBM50409989
(CHEMBL361941)
Show SMILES Oc1cc(O)c(cc1Cl)-c1n[nH]cc1-c1ccc(cc1)-c1ccc(F)cc1
Show InChI InChI=1S/C21H14ClFN2O2/c22-18-9-16(19(26)10-20(18)27)21-17(11-24-25-21)14-3-1-12(2-4-14)13-5-7-15(23)8-6-13/h1-11,26-27H,(H,24,25)
Reactome pathway
n/an/a 1.55E+3n/an/an/an/an/an/a
The Institute of Cancer Research
Curated by ChEMBL
Assay Description
Inhibition of yeast Hsp90 ATPase activity
Bioorg Med Chem Lett 15: 3338-43 (2005)
Article DOI: 10.1016/j.bmcl.2005.05.046
BindingDB Entry DOI: 10.7270/Q22808T2