BDBM50409992 CHEMBL364882
SMILES: Cc1[nH]nc(c1-c1ccccc1)-c1cc(Cl)c(O)cc1O
InChI Key: InChIKey=VEFKDJMCOKAFNX-UHFFFAOYSA-N
Data: 2 IC50
Activity Spreadsheet -- Enzyme Inhibition Constant Data from BindingDB
Found 2 hits for monomerid = 50409992
Trg + Lig
Ki
nM
ΔG°
kcal/mole
IC50
nM
Kd
nM
EC50/IC50
nM
koff
s-1
kon
M-1s-1
pHTemp
°C
Cell cycle histidine kinase CckA
(Caulobacter vibrioides)
BDBM50409992
(CHEMBL364882)
Show SMILES Cc1[nH]nc(c1-c1ccccc1)-c1cc(Cl)c(O)cc1O
Show InChI InChI=1S/C16H13ClN2O2/c1-9-15(10-5-3-2-4-6-10)16(19-18-9)11-7-12(17)14(21)8-13(11)20/h2-8,20-21H,1H3,(H,18,19)
n/an/a 1.75E+4n/an/an/an/an/an/a
Williams College
Curated by ChEMBL
Assay Description
Inhibition of recombinant Caulobacter vibrioides cell cycle histidine kinase CckA deltaTM mutant DHp domain (70 to 691 residues) expressed in Escheri...
Bioorg Med Chem Lett 27: 5235-5244 (2017)
Article DOI: 10.1016/j.bmcl.2017.10.036
BindingDB Entry DOI: 10.7270/Q20G3NQV
Heat Shock Protein 90 (Hsp90)
(Saccharomyces cerevisiae)
BDBM50409992
(CHEMBL364882)
Show SMILES Cc1[nH]nc(c1-c1ccccc1)-c1cc(Cl)c(O)cc1O
Show InChI InChI=1S/C16H13ClN2O2/c1-9-15(10-5-3-2-4-6-10)16(19-18-9)11-7-12(17)14(21)8-13(11)20/h2-8,20-21H,1H3,(H,18,19)
Reactome pathway
n/an/a 1.65E+3n/an/an/an/an/an/a
The Institute of Cancer Research
Curated by ChEMBL
Assay Description
Inhibition of yeast Hsp90 ATPase activity
Bioorg Med Chem Lett 15: 3338-43 (2005)
Article DOI: 10.1016/j.bmcl.2005.05.046
BindingDB Entry DOI: 10.7270/Q22808T2