BDBM50409996 CHEMBL191228
SMILES: Oc1cc(O)c(cc1Cl)-c1n[nH]cc1-c1ccc2OCCOc2c1
InChI Key: InChIKey=VCOQUJZTHUQIBZ-UHFFFAOYSA-N
Data: 2 IC50
Activity Spreadsheet -- Enzyme Inhibition Constant Data from BindingDB
Found 2 hits for monomerid = 50409996
Trg + Lig
Ki
nM
ΔG°
kcal/mole
IC50
nM
Kd
nM
EC50/IC50
nM
koff
s-1
kon
M-1s-1
pHTemp
°C
Cell cycle histidine kinase CckA
(Caulobacter vibrioides)
BDBM50409996
(CHEMBL191228)
Show SMILES Oc1cc(O)c(cc1Cl)-c1n[nH]cc1-c1ccc2OCCOc2c1
Show InChI InChI=1S/C17H13ClN2O4/c18-12-6-10(13(21)7-14(12)22)17-11(8-19-20-17)9-1-2-15-16(5-9)24-4-3-23-15/h1-2,5-8,21-22H,3-4H2,(H,19,20)
n/an/a 3.23E+4n/an/an/an/an/an/a
Williams College
Curated by ChEMBL
Assay Description
Inhibition of recombinant Caulobacter vibrioides cell cycle histidine kinase CckA deltaTM mutant DHp domain (70 to 691 residues) expressed in Escheri...
Bioorg Med Chem Lett 27: 5235-5244 (2017)
Article DOI: 10.1016/j.bmcl.2017.10.036
BindingDB Entry DOI: 10.7270/Q20G3NQV
Heat Shock Protein 90 (Hsp90)
(Saccharomyces cerevisiae)
BDBM50409996
(CHEMBL191228)
Show SMILES Oc1cc(O)c(cc1Cl)-c1n[nH]cc1-c1ccc2OCCOc2c1
Show InChI InChI=1S/C17H13ClN2O4/c18-12-6-10(13(21)7-14(12)22)17-11(8-19-20-17)9-1-2-15-16(5-9)24-4-3-23-15/h1-2,5-8,21-22H,3-4H2,(H,19,20)
Reactome pathway
n/an/a 1.60E+3n/an/an/an/an/an/a
The Institute of Cancer Research
Curated by ChEMBL
Assay Description
Inhibition of yeast Hsp90 ATPase activity
Bioorg Med Chem Lett 15: 3338-43 (2005)
Article DOI: 10.1016/j.bmcl.2005.05.046
BindingDB Entry DOI: 10.7270/Q22808T2