BDBM50410002 CHEMBL360323
SMILES: COc1cc(cc(OC)c1OC)-c1nc2sccc2c(=O)[nH]1
InChI Key: InChIKey=NVKGYPFTIJYUCG-UHFFFAOYSA-N
Data: 2 IC50
Activity Spreadsheet -- Enzyme Inhibition Constant Data from BindingDB
Found 2 hits for monomerid = 50410002
Trg + Lig
Ki
nM
ΔG°
kcal/mole
IC50
nM
Kd
nM
EC50/IC50
nM
koff
s-1
kon
M-1s-1
pHTemp
°C
CDK-interacting protein 1
(Homo sapiens (Human))
BDBM50410002
(CHEMBL360323)
Show SMILES COc1cc(cc(OC)c1OC)-c1nc2sccc2c(=O)[nH]1
Show InChI InChI=1S/C15H14N2O4S/c1-19-10-6-8(7-11(20-2)12(10)21-3)13-16-14(18)9-4-5-22-15(9)17-13/h4-7H,1-3H3,(H,16,17,18)
Reactome pathway
n/an/a>2.00E+4n/an/an/an/an/an/a
Wyeth Research
Curated by ChEMBL
Assay Description
Inhibitory concentration against human p21 proficient cell (p21+/+) proliferation
Bioorg Med Chem Lett 15: 3763-6 (2005)
Article DOI: 10.1016/j.bmcl.2005.05.127
BindingDB Entry DOI: 10.7270/Q2XG9SB7
CDK-interacting protein 1
(Homo sapiens (Human))
BDBM50410002
(CHEMBL360323)
Show SMILES COc1cc(cc(OC)c1OC)-c1nc2sccc2c(=O)[nH]1
Show InChI InChI=1S/C15H14N2O4S/c1-19-10-6-8(7-11(20-2)12(10)21-3)13-16-14(18)9-4-5-22-15(9)17-13/h4-7H,1-3H3,(H,16,17,18)
Reactome pathway
n/an/a>2.00E+4n/an/an/an/an/an/a
Wyeth Research
Curated by ChEMBL
Assay Description
Inhibitory concentration against p21 deficient cell (p21-/-) proliferation
Bioorg Med Chem Lett 15: 3763-6 (2005)
Article DOI: 10.1016/j.bmcl.2005.05.127
BindingDB Entry DOI: 10.7270/Q2XG9SB7