BDBM50410014 CHEMBL178995
SMILES: COc1cc(cc(OC)c1OC)-c1cc(Nc2ccccc2)c2c3CCCCc3sc2n1
InChI Key: InChIKey=WMKOCAZDHOOEKQ-UHFFFAOYSA-N
Data: 2 IC50
Activity Spreadsheet -- Enzyme Inhibition Constant Data from BindingDB
Found 2 hits for monomerid = 50410014
Trg + Lig
Ki
nM
ΔG°
kcal/mole
IC50
nM
Kd
nM
EC50/IC50
nM
koff
s-1
kon
M-1s-1
pHTemp
°C
CDK-interacting protein 1
(Homo sapiens (Human))
BDBM50410014
(CHEMBL178995)
Show SMILES COc1cc(cc(OC)c1OC)-c1cc(Nc2ccccc2)c2c3CCCCc3sc2n1
Show InChI InChI=1S/C26H26N2O3S/c1-29-21-13-16(14-22(30-2)25(21)31-3)19-15-20(27-17-9-5-4-6-10-17)24-18-11-7-8-12-23(18)32-26(24)28-19/h4-6,9-10,13-15H,7-8,11-12H2,1-3H3,(H,27,28)
Reactome pathway
n/an/a>2.00E+4n/an/an/an/an/an/a
Wyeth Research
Curated by ChEMBL
Assay Description
Inhibitory concentration against human p21 proficient cell (p21+/+) proliferation
Bioorg Med Chem Lett 15: 3763-6 (2005)
Article DOI: 10.1016/j.bmcl.2005.05.127
BindingDB Entry DOI: 10.7270/Q2XG9SB7
CDK-interacting protein 1
(Homo sapiens (Human))
BDBM50410014
(CHEMBL178995)
Show SMILES COc1cc(cc(OC)c1OC)-c1cc(Nc2ccccc2)c2c3CCCCc3sc2n1
Show InChI InChI=1S/C26H26N2O3S/c1-29-21-13-16(14-22(30-2)25(21)31-3)19-15-20(27-17-9-5-4-6-10-17)24-18-11-7-8-12-23(18)32-26(24)28-19/h4-6,9-10,13-15H,7-8,11-12H2,1-3H3,(H,27,28)
Reactome pathway
n/an/a>2.00E+4n/an/an/an/an/an/a
Wyeth Research
Curated by ChEMBL
Assay Description
Inhibitory concentration against p21 deficient cell (p21-/-) proliferation
Bioorg Med Chem Lett 15: 3763-6 (2005)
Article DOI: 10.1016/j.bmcl.2005.05.127
BindingDB Entry DOI: 10.7270/Q2XG9SB7