BDBM50410015 CHEMBL179113
SMILES: CCCCOc1ccc(cc1)-c1nc2sc3CCCCc3c2c(=O)[nH]1
InChI Key: InChIKey=HQPFOBVNLVHDOW-UHFFFAOYSA-N
Data: 2 IC50
Activity Spreadsheet -- Enzyme Inhibition Constant Data from BindingDB
Found 2 hits for monomerid = 50410015
Trg + Lig
Ki
nM
ΔG°
kcal/mole
IC50
nM
Kd
nM
EC50/IC50
nM
koff
s-1
kon
M-1s-1
pHTemp
°C
CDK-interacting protein 1
(Homo sapiens (Human))
BDBM50410015
(CHEMBL179113)
Show SMILES CCCCOc1ccc(cc1)-c1nc2sc3CCCCc3c2c(=O)[nH]1
Show InChI InChI=1S/C20H22N2O2S/c1-2-3-12-24-14-10-8-13(9-11-14)18-21-19(23)17-15-6-4-5-7-16(15)25-20(17)22-18/h8-11H,2-7,12H2,1H3,(H,21,22,23)
Reactome pathway
n/an/a>2.00E+4n/an/an/an/an/an/a
Wyeth Research
Curated by ChEMBL
Assay Description
Inhibitory concentration against p21 deficient cell (p21-/-) proliferation
Bioorg Med Chem Lett 15: 3763-6 (2005)
Article DOI: 10.1016/j.bmcl.2005.05.127
BindingDB Entry DOI: 10.7270/Q2XG9SB7
CDK-interacting protein 1
(Homo sapiens (Human))
BDBM50410015
(CHEMBL179113)
Show SMILES CCCCOc1ccc(cc1)-c1nc2sc3CCCCc3c2c(=O)[nH]1
Show InChI InChI=1S/C20H22N2O2S/c1-2-3-12-24-14-10-8-13(9-11-14)18-21-19(23)17-15-6-4-5-7-16(15)25-20(17)22-18/h8-11H,2-7,12H2,1H3,(H,21,22,23)
Reactome pathway
n/an/a>2.00E+4n/an/an/an/an/an/a
Wyeth Research
Curated by ChEMBL
Assay Description
Inhibitory concentration against human p21 proficient cell (p21+/+) proliferation
Bioorg Med Chem Lett 15: 3763-6 (2005)
Article DOI: 10.1016/j.bmcl.2005.05.127
BindingDB Entry DOI: 10.7270/Q2XG9SB7