BDBM50410016 CHEMBL179178
SMILES: CCOc1ccc(cc1)-c1nc2sc3CCCCc3c2c(=O)[nH]1
InChI Key: InChIKey=HFGZUTULELEVGR-UHFFFAOYSA-N
Data: 2 IC50
Activity Spreadsheet -- Enzyme Inhibition Constant Data from BindingDB
Found 2 hits for monomerid = 50410016
Trg + Lig
Ki
nM
ΔG°
kcal/mole
IC50
nM
Kd
nM
EC50/IC50
nM
koff
s-1
kon
M-1s-1
pHTemp
°C
CDK-interacting protein 1
(Homo sapiens (Human))
BDBM50410016
(CHEMBL179178)
Show SMILES CCOc1ccc(cc1)-c1nc2sc3CCCCc3c2c(=O)[nH]1
Show InChI InChI=1S/C18H18N2O2S/c1-2-22-12-9-7-11(8-10-12)16-19-17(21)15-13-5-3-4-6-14(13)23-18(15)20-16/h7-10H,2-6H2,1H3,(H,19,20,21)
Reactome pathway
n/an/a>2.00E+4n/an/an/an/an/an/a
Wyeth Research
Curated by ChEMBL
Assay Description
Inhibitory concentration against human p21 proficient cell (p21+/+) proliferation
Bioorg Med Chem Lett 15: 3763-6 (2005)
Article DOI: 10.1016/j.bmcl.2005.05.127
BindingDB Entry DOI: 10.7270/Q2XG9SB7
CDK-interacting protein 1
(Homo sapiens (Human))
BDBM50410016
(CHEMBL179178)
Show SMILES CCOc1ccc(cc1)-c1nc2sc3CCCCc3c2c(=O)[nH]1
Show InChI InChI=1S/C18H18N2O2S/c1-2-22-12-9-7-11(8-10-12)16-19-17(21)15-13-5-3-4-6-14(13)23-18(15)20-16/h7-10H,2-6H2,1H3,(H,19,20,21)
Reactome pathway
n/an/a 8.40E+3n/an/an/an/an/an/a
Wyeth Research
Curated by ChEMBL
Assay Description
Inhibitory concentration against p21 deficient cell (p21-/-) proliferation
Bioorg Med Chem Lett 15: 3763-6 (2005)
Article DOI: 10.1016/j.bmcl.2005.05.127
BindingDB Entry DOI: 10.7270/Q2XG9SB7