null
SMILES: C[C@H](NC(=O)\C=C\c1ccccc1F)c1cccc(c1)-n1cccn1
InChI Key: InChIKey=MKDAVKXVUHAHLI-NKSUMMKUSA-N
Activity Spreadsheet -- Enzyme Inhibition Constant Data from BindingDB
Found 1 hit for monomerid = 50410082
Trg + Lig
Ki
nM
ΔG°
kcal/mole
IC50
nM
Kd
nM
EC50/IC50
nM
koff
s-1
kon
M-1s-1
pHTemp
°C
Potassium voltage-gated channel subfamily KQT member 2
(Mus musculus)
BDBM50410082
(CHEMBL179854)
Show SMILES C[C@H](NC(=O)\C=C\c1ccccc1F)c1cccc(c1)-n1cccn1
Show InChI InChI=1S/C20H18FN3O/c1-15(17-7-4-8-18(14-17)24-13-5-12-22-24)23-20(25)11-10-16-6-2-3-9-19(16)21/h2-15H,1H3,(H,23,25)/b11-10+/t15-/m0/s1
Reactome pathway
n/an/an/an/a 120n/an/an/an/a
Bristol-Myers Squibb Pharmaceutical Research Institute
Curated by ChEMBL
Assay Description
Effect on outward potassium currents in whole-cell patchclamp assay of HEK 293 cells expressing cloned mouse KCNQ2 channel at -40 mV
Bioorg Med Chem Lett 15: 363-6 (2004)
Article DOI: 10.1016/j.bmcl.2004.10.065
BindingDB Entry DOI: 10.7270/Q2J967KG