BDBM50410244 CHEMBL275999
SMILES: CCCCN(CC(=O)NCC(=O)N[C@@H](CCCCN)C(=O)N[C@H](Cc1ccccc1)C(=O)N(CCCNC(N)=N)CC(=O)N(CC(=O)NCC(N)=O)Cc1c[nH]c2ccccc12)C(C)=O
InChI Key: InChIKey=YFRQSEJYHOCRNR-MPQUPPDSSA-N
Data: 3 IC50  1 EC50
Activity Spreadsheet -- Enzyme Inhibition Constant Data from BindingDB
Found 4 hits for monomerid = 50410244
Trg + Lig
Ki
nM
ΔG°
kcal/mole
IC50
nM
Kd
nM
EC50/IC50
nM
koff
s-1
kon
M-1s-1
pHTemp
°C
Melanocortin receptor 4
(Homo sapiens (Human))
BDBM50410244
(CHEMBL275999)
Show SMILES CCCCN(CC(=O)NCC(=O)N[C@@H](CCCCN)C(=O)N[C@H](Cc1ccccc1)C(=O)N(CCCNC(N)=N)CC(=O)N(CC(=O)NCC(N)=O)Cc1c[nH]c2ccccc12)C(C)=O
Show InChI InChI=1S/C44H65N13O8/c1-3-4-20-55(30(2)58)27-39(61)52-25-38(60)53-35(17-10-11-18-45)42(64)54-36(22-31-13-6-5-7-14-31)43(65)56(21-12-19-49-44(47)48)29-41(63)57(28-40(62)51-24-37(46)59)26-32-23-50-34-16-9-8-15-33(32)34/h5-9,13-16,23,35-36,50H,3-4,10-12,17-22,24-29,45H2,1-2H3,(H2,46,59)(H,51,62)(H,52,61)(H,53,60)(H,54,64)(H4,47,48,49)/t35-,36+/m0/s1
n/an/a 794n/an/an/an/an/an/a
Utrecht University
Curated by ChEMBL
Assay Description
Displacement of [125I]NDP-MSH from human melanocortin receptor-4 expressed in 293 HEK cells
J Med Chem 48: 4224-30 (2005)
Article DOI: 10.1021/jm0490033
BindingDB Entry DOI: 10.7270/Q2QV3NQ5
Melanocortin receptor 5 (MC5R)
(Mus musculus (Mouse))
BDBM50410244
(CHEMBL275999)
Show SMILES CCCCN(CC(=O)NCC(=O)N[C@@H](CCCCN)C(=O)N[C@H](Cc1ccccc1)C(=O)N(CCCNC(N)=N)CC(=O)N(CC(=O)NCC(N)=O)Cc1c[nH]c2ccccc12)C(C)=O
Show InChI InChI=1S/C44H65N13O8/c1-3-4-20-55(30(2)58)27-39(61)52-25-38(60)53-35(17-10-11-18-45)42(64)54-36(22-31-13-6-5-7-14-31)43(65)56(21-12-19-49-44(47)48)29-41(63)57(28-40(62)51-24-37(46)59)26-32-23-50-34-16-9-8-15-33(32)34/h5-9,13-16,23,35-36,50H,3-4,10-12,17-22,24-29,45H2,1-2H3,(H2,46,59)(H,51,62)(H,52,61)(H,53,60)(H,54,64)(H4,47,48,49)/t35-,36+/m0/s1
n/an/a 3.16E+3n/an/an/an/an/an/a
Utrecht University
Curated by ChEMBL
Assay Description
Displacement of [125I]NDP-MSH from mouse melanocortin receptor-5 expressed in 293 HEK cells
J Med Chem 48: 4224-30 (2005)
Article DOI: 10.1021/jm0490033
BindingDB Entry DOI: 10.7270/Q2QV3NQ5
Melanocortin receptor 3
(Homo sapiens (Human))
BDBM50410244
(CHEMBL275999)
Show SMILES CCCCN(CC(=O)NCC(=O)N[C@@H](CCCCN)C(=O)N[C@H](Cc1ccccc1)C(=O)N(CCCNC(N)=N)CC(=O)N(CC(=O)NCC(N)=O)Cc1c[nH]c2ccccc12)C(C)=O
Show InChI InChI=1S/C44H65N13O8/c1-3-4-20-55(30(2)58)27-39(61)52-25-38(60)53-35(17-10-11-18-45)42(64)54-36(22-31-13-6-5-7-14-31)43(65)56(21-12-19-49-44(47)48)29-41(63)57(28-40(62)51-24-37(46)59)26-32-23-50-34-16-9-8-15-33(32)34/h5-9,13-16,23,35-36,50H,3-4,10-12,17-22,24-29,45H2,1-2H3,(H2,46,59)(H,51,62)(H,52,61)(H,53,60)(H,54,64)(H4,47,48,49)/t35-,36+/m0/s1
n/an/a 7.94E+3n/an/an/an/an/an/a
Utrecht University
Curated by ChEMBL
Assay Description
Effective concentration against human melanocortin receptor-3 expressed in 293 HEK cells
J Med Chem 48: 4224-30 (2005)
Article DOI: 10.1021/jm0490033
BindingDB Entry DOI: 10.7270/Q2QV3NQ5
Melanocortin receptor 4
(Homo sapiens (Human))
BDBM50410244
(CHEMBL275999)
Show SMILES CCCCN(CC(=O)NCC(=O)N[C@@H](CCCCN)C(=O)N[C@H](Cc1ccccc1)C(=O)N(CCCNC(N)=N)CC(=O)N(CC(=O)NCC(N)=O)Cc1c[nH]c2ccccc12)C(C)=O
Show InChI InChI=1S/C44H65N13O8/c1-3-4-20-55(30(2)58)27-39(61)52-25-38(60)53-35(17-10-11-18-45)42(64)54-36(22-31-13-6-5-7-14-31)43(65)56(21-12-19-49-44(47)48)29-41(63)57(28-40(62)51-24-37(46)59)26-32-23-50-34-16-9-8-15-33(32)34/h5-9,13-16,23,35-36,50H,3-4,10-12,17-22,24-29,45H2,1-2H3,(H2,46,59)(H,51,62)(H,52,61)(H,53,60)(H,54,64)(H4,47,48,49)/t35-,36+/m0/s1
n/an/an/an/a 501n/an/an/an/a
Utrecht University
Curated by ChEMBL
Assay Description
Displacement of [125I]NDP-MSH from human melanocortin receptor-4 expressed in 293 HEK cells
J Med Chem 48: 4224-30 (2005)
Article DOI: 10.1021/jm0490033
BindingDB Entry DOI: 10.7270/Q2QV3NQ5