BDBM50410317 CHEMBL2096696
SMILES: Fc1ccc(C[C@H]2CCCN(C[C@@H]3CCCC[C@H]3NC(=O)Nc3cccc(c3)C#N)C2)cc1
InChI Key: InChIKey=YYWBSASXGCRFHA-MVERNJQCSA-N
Data: 1 IC50
Activity Spreadsheet -- Enzyme Inhibition Constant Data from BindingDB
Found 1 hit for monomerid = 50410317
Trg + Lig
Ki
nM
ΔG°
kcal/mole
IC50
nM
Kd
nM
EC50/IC50
nM
koff
s-1
kon
M-1s-1
pHTemp
°C
C-C chemokine receptor type 3
(Homo sapiens (Human))
BDBM50410317
(CHEMBL2096696)
Show SMILES Fc1ccc(C[C@H]2CCCN(C[C@@H]3CCCC[C@H]3NC(=O)Nc3cccc(c3)C#N)C2)cc1
Show InChI InChI=1S/C27H33FN4O/c28-24-12-10-20(11-13-24)15-22-6-4-14-32(18-22)19-23-7-1-2-9-26(23)31-27(33)30-25-8-3-5-21(16-25)17-29/h3,5,8,10-13,16,22-23,26H,1-2,4,6-7,9,14-15,18-19H2,(H2,30,31,33)/t22-,23+,26-/m1/s1
Reactome pathway
n/an/a 9n/an/an/an/an/an/a
Pharmaceutical Research Institute
Curated by ChEMBL
Assay Description
Inhibition of eotaxin-induced chemotaxis of human eosinophils
J Med Chem 48: 2194-211 (2005)
Article DOI: 10.1021/jm049530m
BindingDB Entry DOI: 10.7270/Q2XP74F1