BDBM50410329 CHEMBL427177
SMILES: CC(C)N1CCC(CC1)Oc1ccc(CN2CCCCCC2)cc1
InChI Key: InChIKey=WXRNQGKALPBTPJ-UHFFFAOYSA-N
Data: 1 KI  1 Kd
Activity Spreadsheet -- Enzyme Inhibition Constant Data from BindingDB
Found 2 hits for monomerid = 50410329
Trg + Lig
Ki
nM
ΔG°
kcal/mole
IC50
nM
Kd
nM
EC50/IC50
nM
koff
s-1
kon
M-1s-1
pHTemp
°C
Histamine H3 receptor
(Homo sapiens (Human))
BDBM50410329
(CHEMBL427177)
Show SMILES CC(C)N1CCC(CC1)Oc1ccc(CN2CCCCCC2)cc1
Show InChI InChI=1S/C21H34N2O/c1-18(2)23-15-11-21(12-16-23)24-20-9-7-19(8-10-20)17-22-13-5-3-4-6-14-22/h7-10,18,21H,3-6,11-17H2,1-2H3
Reactome pathway
1.70n/an/an/an/an/an/an/an/a
Johnson& Johnson Pharmaceutical Research and Development
Curated by ChEMBL
Assay Description
Mean binding affinity for human H3 receptor
J Med Chem 48: 2229-38 (2005)
Article DOI: 10.1021/jm049212n
BindingDB Entry DOI: 10.7270/Q2GB258T
Histamine H3 receptor
(Homo sapiens (Human))
BDBM50410329
(CHEMBL427177)
Show SMILES CC(C)N1CCC(CC1)Oc1ccc(CN2CCCCCC2)cc1
Show InChI InChI=1S/C21H34N2O/c1-18(2)23-15-11-21(12-16-23)24-20-9-7-19(8-10-20)17-22-13-5-3-4-6-14-22/h7-10,18,21H,3-6,11-17H2,1-2H3
Reactome pathway
n/an/an/a 0.174n/an/an/an/an/a
Johnson& Johnson Pharmaceutical Research and Development
Curated by ChEMBL
Assay Description
Mean functional activity against human H3 receptor
J Med Chem 48: 2229-38 (2005)
Article DOI: 10.1021/jm049212n
BindingDB Entry DOI: 10.7270/Q2GB258T