BDBM50410337 CHEMBL194090
SMILES: CC(C)N1CCC(CC1)Oc1ccc(CN2CCN(Cc3ccccc3)CC2)cc1
InChI Key: InChIKey=QZVUVDIPJNQXBD-UHFFFAOYSA-N
Data: 1 KI  1 Kd
Activity Spreadsheet -- Enzyme Inhibition Constant Data from BindingDB
Found 2 hits for monomerid = 50410337
Trg + Lig
Ki
nM
ΔG°
kcal/mole
IC50
nM
Kd
nM
EC50/IC50
nM
koff
s-1
kon
M-1s-1
pHTemp
°C
Histamine H3 receptor
(Homo sapiens (Human))
BDBM50410337
(CHEMBL194090)
Show SMILES CC(C)N1CCC(CC1)Oc1ccc(CN2CCN(Cc3ccccc3)CC2)cc1
Show InChI InChI=1S/C26H37N3O/c1-22(2)29-14-12-26(13-15-29)30-25-10-8-24(9-11-25)21-28-18-16-27(17-19-28)20-23-6-4-3-5-7-23/h3-11,22,26H,12-21H2,1-2H3
Reactome pathway
2n/an/an/an/an/an/an/an/a
Johnson& Johnson Pharmaceutical Research and Development
Curated by ChEMBL
Assay Description
Mean binding affinity for human H3 receptor
J Med Chem 48: 2229-38 (2005)
Article DOI: 10.1021/jm049212n
BindingDB Entry DOI: 10.7270/Q2GB258T
Histamine H3 receptor
(Homo sapiens (Human))
BDBM50410337
(CHEMBL194090)
Show SMILES CC(C)N1CCC(CC1)Oc1ccc(CN2CCN(Cc3ccccc3)CC2)cc1
Show InChI InChI=1S/C26H37N3O/c1-22(2)29-14-12-26(13-15-29)30-25-10-8-24(9-11-25)21-28-18-16-27(17-19-28)20-23-6-4-3-5-7-23/h3-11,22,26H,12-21H2,1-2H3
Reactome pathway
n/an/an/a 0.661n/an/an/an/an/a
Johnson& Johnson Pharmaceutical Research and Development
Curated by ChEMBL
Assay Description
Mean functional activity against human H3 receptor
J Med Chem 48: 2229-38 (2005)
Article DOI: 10.1021/jm049212n
BindingDB Entry DOI: 10.7270/Q2GB258T