BDBM50410343 CHEMBL191992
SMILES: CC(C)N1CCC(CC1)Oc1ccc(CN(C)C)cc1
InChI Key: InChIKey=GXDDZXKMWVFNHP-UHFFFAOYSA-N
Data: 1 KI  1 Kd
Activity Spreadsheet -- Enzyme Inhibition Constant Data from BindingDB
Found 2 hits for monomerid = 50410343
Trg + Lig
Ki
nM
ΔG°
kcal/mole
IC50
nM
Kd
nM
EC50/IC50
nM
koff
s-1
kon
M-1s-1
pHTemp
°C
Histamine H3 receptor
(Homo sapiens (Human))
BDBM50410343
(CHEMBL191992)
Show SMILES CC(C)N1CCC(CC1)Oc1ccc(CN(C)C)cc1
Show InChI InChI=1S/C17H28N2O/c1-14(2)19-11-9-17(10-12-19)20-16-7-5-15(6-8-16)13-18(3)4/h5-8,14,17H,9-13H2,1-4H3
Reactome pathway
3.02n/an/an/an/an/an/an/an/a
Johnson& Johnson Pharmaceutical Research and Development
Curated by ChEMBL
Assay Description
Mean binding affinity for human H3 receptor
J Med Chem 48: 2229-38 (2005)
Article DOI: 10.1021/jm049212n
BindingDB Entry DOI: 10.7270/Q2GB258T
Histamine H3 receptor
(Homo sapiens (Human))
BDBM50410343
(CHEMBL191992)
Show SMILES CC(C)N1CCC(CC1)Oc1ccc(CN(C)C)cc1
Show InChI InChI=1S/C17H28N2O/c1-14(2)19-11-9-17(10-12-19)20-16-7-5-15(6-8-16)13-18(3)4/h5-8,14,17H,9-13H2,1-4H3
Reactome pathway
n/an/an/a 1.17n/an/an/an/an/a
Johnson& Johnson Pharmaceutical Research and Development
Curated by ChEMBL
Assay Description
Mean functional activity against human H3 receptor
J Med Chem 48: 2229-38 (2005)
Article DOI: 10.1021/jm049212n
BindingDB Entry DOI: 10.7270/Q2GB258T