BDBM50410347 CHEMBL194441
SMILES: CC(C)N1CCC(CC1)Oc1ccc(CN2CCCCC2)cc1
InChI Key: InChIKey=DEHKDVJSSBSAEQ-UHFFFAOYSA-N
Data: 1 KI  1 Kd
Activity Spreadsheet -- Enzyme Inhibition Constant Data from BindingDB
Found 2 hits for monomerid = 50410347
Trg + Lig
Ki
nM
ΔG°
kcal/mole
IC50
nM
Kd
nM
EC50/IC50
nM
koff
s-1
kon
M-1s-1
pHTemp
°C
Histamine H3 receptor
(Homo sapiens (Human))
BDBM50410347
(CHEMBL194441)
Show SMILES CC(C)N1CCC(CC1)Oc1ccc(CN2CCCCC2)cc1
Show InChI InChI=1S/C20H32N2O/c1-17(2)22-14-10-20(11-15-22)23-19-8-6-18(7-9-19)16-21-12-4-3-5-13-21/h6-9,17,20H,3-5,10-16H2,1-2H3
Reactome pathway
0.631n/an/an/an/an/an/an/an/a
Johnson& Johnson Pharmaceutical Research and Development
Curated by ChEMBL
Assay Description
Mean binding affinity for human H3 receptor
J Med Chem 48: 2229-38 (2005)
Article DOI: 10.1021/jm049212n
BindingDB Entry DOI: 10.7270/Q2GB258T
Histamine H3 receptor
(Homo sapiens (Human))
BDBM50410347
(CHEMBL194441)
Show SMILES CC(C)N1CCC(CC1)Oc1ccc(CN2CCCCC2)cc1
Show InChI InChI=1S/C20H32N2O/c1-17(2)22-14-10-20(11-15-22)23-19-8-6-18(7-9-19)16-21-12-4-3-5-13-21/h6-9,17,20H,3-5,10-16H2,1-2H3
Reactome pathway
n/an/an/a 0.126n/an/an/an/an/a
Johnson& Johnson Pharmaceutical Research and Development
Curated by ChEMBL
Assay Description
Mean functional activity against human H3 receptor
J Med Chem 48: 2229-38 (2005)
Article DOI: 10.1021/jm049212n
BindingDB Entry DOI: 10.7270/Q2GB258T