BDBM50410550 CHEMBL370882
SMILES: Cc1ccc(-c2nc(CCC34CC5CC(CC(C5)C3)C4)c([nH]2)C(=O)Nc2cccc(c2)C(O)=O)c(C)c1
InChI Key: InChIKey=CQBPOKFLLSPKGU-UHFFFAOYSA-N
Data: 1 Kd
Activity Spreadsheet -- Enzyme Inhibition Constant Data from BindingDB
Found 1 hit for monomerid = 50410550
Trg + Lig
Ki
nM
ΔG°
kcal/mole
IC50
nM
Kd
nM
EC50/IC50
nM
koff
s-1
kon
M-1s-1
pHTemp
°C
CCKBR
(RAT)
BDBM50410550
(CHEMBL370882)
Show SMILES Cc1ccc(-c2nc(CCC34CC5CC(CC(C5)C3)C4)c([nH]2)C(=O)Nc2cccc(c2)C(O)=O)c(C)c1 |TLB:17:16:19:12.11.13,17:12:19:16.18.15,13:14:18:12.11.17,THB:13:12:18:14.19.15,15:14:11:16.18.17,15:16:11:14.19.13|
Show InChI InChI=1S/C31H35N3O3/c1-18-6-7-25(19(2)10-18)28-33-26(8-9-31-15-20-11-21(16-31)13-22(12-20)17-31)27(34-28)29(35)32-24-5-3-4-23(14-24)30(36)37/h3-7,10,14,20-22H,8-9,11-13,15-17H2,1-2H3,(H,32,35)(H,33,34)(H,36,37)
n/an/an/a 10n/an/an/an/an/a
James Black Foundation
Curated by ChEMBL
Assay Description
Antagonist activity against CCK2 receptor estimated from single shifts of pentagastrin concentration-effect curves in the isolated rat stomach
J Med Chem 48: 6803-12 (2005)
Article DOI: 10.1021/jm0490686
BindingDB Entry DOI: 10.7270/Q2PV6MM7