BDBM50410556 CHEMBL197780
SMILES: Cc1cc(C)c(-c2nc(COC34CC5CC(CC(C5)C3)C4)c([nH]2)C(=O)Nc2cccc(c2)C(O)=O)c(C)c1
InChI Key: InChIKey=XVPUHDXGAHGMAZ-UHFFFAOYSA-N
Data: 1 IC50  1 Kd
Activity Spreadsheet -- Enzyme Inhibition Constant Data from BindingDB
Found 2 hits for monomerid = 50410556
Trg + Lig
Ki
nM
ΔG°
kcal/mole
IC50
nM
Kd
nM
EC50/IC50
nM
koff
s-1
kon
M-1s-1
pHTemp
°C
CCKBR
(RAT)
BDBM50410556
(CHEMBL197780)
Show SMILES Cc1cc(C)c(-c2nc(COC34CC5CC(CC(C5)C3)C4)c([nH]2)C(=O)Nc2cccc(c2)C(O)=O)c(C)c1 |TLB:18:17:20:13.12.14,18:13:20:17.19.16,14:15:19:13.12.18,THB:14:13:19:15.20.16,16:15:12:17.19.18,16:17:12:15.20.14|
Show InChI InChI=1S/C31H35N3O4/c1-17-7-18(2)26(19(3)8-17)28-33-25(16-38-31-13-20-9-21(14-31)11-22(10-20)15-31)27(34-28)29(35)32-24-6-4-5-23(12-24)30(36)37/h4-8,12,20-22H,9-11,13-16H2,1-3H3,(H,32,35)(H,33,34)(H,36,37)
n/an/an/a 13.5n/an/an/an/an/a
James Black Foundation
Curated by ChEMBL
Assay Description
Antagonist activity against CCK2 receptor estimated from single shifts of pentagastrin concentration-effect curves in the isolated rat stomach
J Med Chem 48: 6803-12 (2005)
Article DOI: 10.1021/jm0490686
BindingDB Entry DOI: 10.7270/Q2PV6MM7
Cholecystokinin B receptor
(Dog)
BDBM50410556
(CHEMBL197780)
Show SMILES Cc1cc(C)c(-c2nc(COC34CC5CC(CC(C5)C3)C4)c([nH]2)C(=O)Nc2cccc(c2)C(O)=O)c(C)c1 |TLB:18:17:20:13.12.14,18:13:20:17.19.16,14:15:19:13.12.18,THB:14:13:19:15.20.16,16:15:12:17.19.18,16:17:12:15.20.14|
Show InChI InChI=1S/C31H35N3O4/c1-17-7-18(2)26(19(3)8-17)28-33-25(16-38-31-13-20-9-21(14-31)11-22(10-20)15-31)27(34-28)29(35)32-24-6-4-5-23(12-24)30(36)37/h4-8,12,20-22H,9-11,13-16H2,1-3H3,(H,32,35)(H,33,34)(H,36,37)
n/an/a 63n/an/an/an/an/an/a
James Black Foundation
Curated by ChEMBL
Assay Description
Concentration required to inhibit the binding of [125I]-BH-CCK-8S radioligand to canine gastric mucosa CCK2 receptor
J Med Chem 48: 6803-12 (2005)
Article DOI: 10.1021/jm0490686
BindingDB Entry DOI: 10.7270/Q2PV6MM7