BDBM50410562 CHEMBL371068
SMILES: OC(=O)c1cccc(NC(=O)c2[nH]c(nc2CCC23CC4CC(CC(C4)C2)C3)-c2ccccc2)c1
InChI Key: InChIKey=YNIDWYLBKQOAHI-UHFFFAOYSA-N
Data: 1 Kd
Activity Spreadsheet -- Enzyme Inhibition Constant Data from BindingDB
Found 1 hit for monomerid = 50410562
Trg + Lig
Ki
nM
ΔG°
kcal/mole
IC50
nM
Kd
nM
EC50/IC50
nM
koff
s-1
kon
M-1s-1
pHTemp
°C
CCKBR
(RAT)
BDBM50410562
(CHEMBL371068)
Show SMILES OC(=O)c1cccc(NC(=O)c2[nH]c(nc2CCC23CC4CC(CC(C4)C2)C3)-c2ccccc2)c1 |TLB:21:22:26:20.19.25,THB:21:20:26:22.27.23,23:22:19:24.26.25,23:24:19:22.27.21|
Show InChI InChI=1S/C29H31N3O3/c33-27(30-23-8-4-7-22(14-23)28(34)35)25-24(31-26(32-25)21-5-2-1-3-6-21)9-10-29-15-18-11-19(16-29)13-20(12-18)17-29/h1-8,14,18-20H,9-13,15-17H2,(H,30,33)(H,31,32)(H,34,35)
n/an/an/a 234n/an/an/an/an/a
James Black Foundation
Curated by ChEMBL
Assay Description
Antagonist activity against CCK2 receptor estimated from single shifts of pentagastrin concentration-effect curves in the isolated rat stomach
J Med Chem 48: 6803-12 (2005)
Article DOI: 10.1021/jm0490686
BindingDB Entry DOI: 10.7270/Q2PV6MM7