null
SMILES: CCOc1nc2ccccc2nc1C(=O)Nc1cc(CN2CCOCC2)c(O)c(c1)N1CCOCC1
InChI Key: InChIKey=UZEDTYIQWUBDES-UHFFFAOYSA-N
Activity Spreadsheet -- Enzyme Inhibition Constant Data from BindingDB
Found 1 hit for monomerid = 50410877
Trg + Lig
Ki
nM
ΔG°
kcal/mole
IC50
nM
Kd
nM
EC50/IC50
nM
koff
s-1
kon
M-1s-1
pHTemp
°C
5-hydroxytryptamine receptor 3A
(GUINEA PIG)
BDBM50410877
(CHEMBL209142)
Show SMILES CCOc1nc2ccccc2nc1C(=O)Nc1cc(CN2CCOCC2)c(O)c(c1)N1CCOCC1
Show InChI InChI=1S/C26H31N5O5/c1-2-36-26-23(28-20-5-3-4-6-21(20)29-26)25(33)27-19-15-18(17-30-7-11-34-12-8-30)24(32)22(16-19)31-9-13-35-14-10-31/h3-6,15-16,32H,2,7-14,17H2,1H3,(H,27,33)
n/an/an/a>1.00E+6n/an/an/an/an/a
Periyar College of Pharmaceutical Sciences for Girls
Curated by ChEMBL
Assay Description
Antagonist effect against 2-methyl-5-HT activity at 5-HT3 receptor in longitudinal muscle myenteric plexus from guinea pig ileum
Bioorg Med Chem Lett 16: 2769-72 (2006)
Article DOI: 10.1016/j.bmcl.2006.02.006
BindingDB Entry DOI: 10.7270/Q2MW2JCG