BDBM50410880 CHEMBL377027
SMILES: CCOc1nc2ccccc2nc1C(=O)Nc1ccc(O)c(CN2CCOCC2)c1
InChI Key: InChIKey=ZYMDBWGVTFDFPE-UHFFFAOYSA-N
Data: 1 Kd
Activity Spreadsheet -- Enzyme Inhibition Constant Data from BindingDB
Found 1 hit for monomerid = 50410880
Trg + Lig
Ki
nM
ΔG°
kcal/mole
IC50
nM
Kd
nM
EC50/IC50
nM
koff
s-1
kon
M-1s-1
pHTemp
°C
5-hydroxytryptamine receptor 3A
(GUINEA PIG)
BDBM50410880
(CHEMBL377027)
Show SMILES CCOc1nc2ccccc2nc1C(=O)Nc1ccc(O)c(CN2CCOCC2)c1
Show InChI InChI=1S/C22H24N4O4/c1-2-30-22-20(24-17-5-3-4-6-18(17)25-22)21(28)23-16-7-8-19(27)15(13-16)14-26-9-11-29-12-10-26/h3-8,13,27H,2,9-12,14H2,1H3,(H,23,28)
n/an/an/a>1.00E+6n/an/an/an/an/a
Periyar College of Pharmaceutical Sciences for Girls
Curated by ChEMBL
Assay Description
Antagonist effect against 2-methyl-5-HT activity at 5-HT3 receptor in longitudinal muscle myenteric plexus from guinea pig ileum
Bioorg Med Chem Lett 16: 2769-72 (2006)
Article DOI: 10.1016/j.bmcl.2006.02.006
BindingDB Entry DOI: 10.7270/Q2MW2JCG