BDBM50411020 CHEMBL211266
SMILES: CC(C)CC1(CC(O)(C(=O)Nc2ccc3c(c2)c(C)noc3=O)C(F)(F)F)CCCc2ccccc12
InChI Key: InChIKey=PKXRAZXSGIAQRD-UHFFFAOYSA-N
Data: 3 IC50  1 EC50
Activity Spreadsheet -- Enzyme Inhibition Constant Data from BindingDB
Found 4 hits for monomerid = 50411020
Trg + Lig
Ki
nM
ΔG°
kcal/mole
IC50
nM
Kd
nM
EC50/IC50
nM
koff
s-1
kon
M-1s-1
pHTemp
°C
Glucocorticoid receptor
(Homo sapiens (Human))
BDBM50411020
(CHEMBL211266)
Show SMILES CC(C)CC1(CC(O)(C(=O)Nc2ccc3c(c2)c(C)noc3=O)C(F)(F)F)CCCc2ccccc12
Show InChI InChI=1S/C27H29F3N2O4/c1-16(2)14-25(12-6-8-18-7-4-5-9-22(18)25)15-26(35,27(28,29)30)24(34)31-19-10-11-20-21(13-19)17(3)32-36-23(20)33/h4-5,7,9-11,13,16,35H,6,8,12,14-15H2,1-3H3,(H,31,34)
n/an/an/an/a<1.00E+3n/an/an/an/a
GlaxoSmithKline Medicines Research Centre
Curated by ChEMBL
Assay Description
Agonist activity at GR assessed as MMTV-mediated transactivation of renilla luciferase gene in human A549 cells relative to Dexamethasone
J Med Chem 49: 4216-31 (2006)
Checked by Author
Article DOI: 10.1021/jm060302x
BindingDB Entry DOI: 10.7270/Q2BC40SB
Glucocorticoid receptor
(Homo sapiens (Human))
BDBM50411020
(CHEMBL211266)
Show SMILES CC(C)CC1(CC(O)(C(=O)Nc2ccc3c(c2)c(C)noc3=O)C(F)(F)F)CCCc2ccccc12
Show InChI InChI=1S/C27H29F3N2O4/c1-16(2)14-25(12-6-8-18-7-4-5-9-22(18)25)15-26(35,27(28,29)30)24(34)31-19-10-11-20-21(13-19)17(3)32-36-23(20)33/h4-5,7,9-11,13,16,35H,6,8,12,14-15H2,1-3H3,(H,31,34)
n/an/a 16n/an/an/an/an/an/a
GlaxoSmithKline Medicines Research Centre
Curated by ChEMBL
Assay Description
Agonist activity at GR assessed as NF-kappaB-mediated transrepression of secreted placental alkaline phosphatase gene in human A549 cells
J Med Chem 49: 4216-31 (2006)
Checked by Author
Article DOI: 10.1021/jm060302x
BindingDB Entry DOI: 10.7270/Q2BC40SB
Glucocorticoid receptor
(Homo sapiens (Human))
BDBM50411020
(CHEMBL211266)
Show SMILES CC(C)CC1(CC(O)(C(=O)Nc2ccc3c(c2)c(C)noc3=O)C(F)(F)F)CCCc2ccccc12
Show InChI InChI=1S/C27H29F3N2O4/c1-16(2)14-25(12-6-8-18-7-4-5-9-22(18)25)15-26(35,27(28,29)30)24(34)31-19-10-11-20-21(13-19)17(3)32-36-23(20)33/h4-5,7,9-11,13,16,35H,6,8,12,14-15H2,1-3H3,(H,31,34)
n/an/a 3.5n/an/an/an/an/an/a
GlaxoSmithKline Medicines Research Centre
Curated by ChEMBL
Assay Description
Inhibition of fluorescent-labeled Dexamethasone binding to GR
J Med Chem 49: 4216-31 (2006)
Checked by Author
Article DOI: 10.1021/jm060302x
BindingDB Entry DOI: 10.7270/Q2BC40SB
Glucocorticoid receptor
(Homo sapiens (Human))
BDBM50411020
(CHEMBL211266)
Show SMILES CC(C)CC1(CC(O)(C(=O)Nc2ccc3c(c2)c(C)noc3=O)C(F)(F)F)CCCc2ccccc12
Show InChI InChI=1S/C27H29F3N2O4/c1-16(2)14-25(12-6-8-18-7-4-5-9-22(18)25)15-26(35,27(28,29)30)24(34)31-19-10-11-20-21(13-19)17(3)32-36-23(20)33/h4-5,7,9-11,13,16,35H,6,8,12,14-15H2,1-3H3,(H,31,34)
n/an/a 513n/an/an/an/an/an/a
GlaxoSmithKline Medicines Research Centre
Curated by ChEMBL
Assay Description
Activity at GR assessed as ability to antagonize dexamethasone-induced MMTV luciferase reporter gene transactivation in human A549 cells
J Med Chem 49: 4216-31 (2006)
Checked by Author
Article DOI: 10.1021/jm060302x
BindingDB Entry DOI: 10.7270/Q2BC40SB