BDBM50411037 CHEMBL213453
SMILES: CCCC1(CC(O)(C(=O)Nc2ccc3c(c2)c(C)noc3=O)C(F)(F)F)CCCc2ccccc12
InChI Key: InChIKey=HFNAATWAYMXXOI-UHFFFAOYSA-N
Data: 3 IC50  1 EC50
Activity Spreadsheet -- Enzyme Inhibition Constant Data from BindingDB
Found 4 hits for monomerid = 50411037
Trg + Lig
Ki
nM
ΔG°
kcal/mole
IC50
nM
Kd
nM
EC50/IC50
nM
koff
s-1
kon
M-1s-1
pHTemp
°C
Glucocorticoid receptor
(Homo sapiens (Human))
BDBM50411037
(CHEMBL213453)
Show SMILES CCCC1(CC(O)(C(=O)Nc2ccc3c(c2)c(C)noc3=O)C(F)(F)F)CCCc2ccccc12
Show InChI InChI=1S/C26H27F3N2O4/c1-3-12-24(13-6-8-17-7-4-5-9-21(17)24)15-25(34,26(27,28)29)23(33)30-18-10-11-19-20(14-18)16(2)31-35-22(19)32/h4-5,7,9-11,14,34H,3,6,8,12-13,15H2,1-2H3,(H,30,33)
n/an/an/an/a 20n/an/an/an/a
GlaxoSmithKline Medicines Research Centre
Curated by ChEMBL
Assay Description
Agonist activity at GR assessed as MMTV-mediated transactivation of renilla luciferase gene in human A549 cells relative to Dexamethasone
J Med Chem 49: 4216-31 (2006)
Checked by Author
Article DOI: 10.1021/jm060302x
BindingDB Entry DOI: 10.7270/Q2BC40SB
Glucocorticoid receptor
(Homo sapiens (Human))
BDBM50411037
(CHEMBL213453)
Show SMILES CCCC1(CC(O)(C(=O)Nc2ccc3c(c2)c(C)noc3=O)C(F)(F)F)CCCc2ccccc12
Show InChI InChI=1S/C26H27F3N2O4/c1-3-12-24(13-6-8-17-7-4-5-9-21(17)24)15-25(34,26(27,28)29)23(33)30-18-10-11-19-20(14-18)16(2)31-35-22(19)32/h4-5,7,9-11,14,34H,3,6,8,12-13,15H2,1-2H3,(H,30,33)
n/an/a 5.60n/an/an/an/an/an/a
GlaxoSmithKline Medicines Research Centre
Curated by ChEMBL
Assay Description
Inhibition of fluorescent-labeled Dexamethasone binding to GR
J Med Chem 49: 4216-31 (2006)
Checked by Author
Article DOI: 10.1021/jm060302x
BindingDB Entry DOI: 10.7270/Q2BC40SB
Glucocorticoid receptor
(Homo sapiens (Human))
BDBM50411037
(CHEMBL213453)
Show SMILES CCCC1(CC(O)(C(=O)Nc2ccc3c(c2)c(C)noc3=O)C(F)(F)F)CCCc2ccccc12
Show InChI InChI=1S/C26H27F3N2O4/c1-3-12-24(13-6-8-17-7-4-5-9-21(17)24)15-25(34,26(27,28)29)23(33)30-18-10-11-19-20(14-18)16(2)31-35-22(19)32/h4-5,7,9-11,14,34H,3,6,8,12-13,15H2,1-2H3,(H,30,33)
n/an/a 25n/an/an/an/an/an/a
GlaxoSmithKline Medicines Research Centre
Curated by ChEMBL
Assay Description
Activity at GR assessed as ability to antagonize dexamethasone-induced MMTV luciferase reporter gene transactivation in human A549 cells
J Med Chem 49: 4216-31 (2006)
Checked by Author
Article DOI: 10.1021/jm060302x
BindingDB Entry DOI: 10.7270/Q2BC40SB
Glucocorticoid receptor
(Homo sapiens (Human))
BDBM50411037
(CHEMBL213453)
Show SMILES CCCC1(CC(O)(C(=O)Nc2ccc3c(c2)c(C)noc3=O)C(F)(F)F)CCCc2ccccc12
Show InChI InChI=1S/C26H27F3N2O4/c1-3-12-24(13-6-8-17-7-4-5-9-21(17)24)15-25(34,26(27,28)29)23(33)30-18-10-11-19-20(14-18)16(2)31-35-22(19)32/h4-5,7,9-11,14,34H,3,6,8,12-13,15H2,1-2H3,(H,30,33)
n/an/a 4.70n/an/an/an/an/an/a
GlaxoSmithKline Medicines Research Centre
Curated by ChEMBL
Assay Description
Agonist activity at GR assessed as NF-kappaB-mediated transrepression of secreted placental alkaline phosphatase gene in human A549 cells
J Med Chem 49: 4216-31 (2006)
Checked by Author
Article DOI: 10.1021/jm060302x
BindingDB Entry DOI: 10.7270/Q2BC40SB