BDBM50411199 CHEMBL2096737
SMILES: Oc1c(C(=O)c2ccc(cc2)C(F)(F)F)c(=O)n(-c2ccc(Cl)cc2)n1-c1ccc(Cl)cc1
InChI Key: InChIKey=MCSQYEXHAXQCNI-UHFFFAOYSA-N
Data: 2 IC50
Activity Spreadsheet -- Enzyme Inhibition Constant Data from BindingDB
Found 2 hits for monomerid = 50411199
Trg + Lig
Ki
nM
ΔG°
kcal/mole
IC50
nM
Kd
nM
EC50/IC50
nM
koff
s-1
kon
M-1s-1
pHTemp
°C
MurB (E. coli)
(Escherichia coli K-12 (Enterobacteria))
BDBM50411199
(CHEMBL2096737)
Show SMILES Oc1c(C(=O)c2ccc(cc2)C(F)(F)F)c(=O)n(-c2ccc(Cl)cc2)n1-c1ccc(Cl)cc1
Show InChI InChI=1S/C23H13Cl2F3N2O3/c24-15-5-9-17(10-6-15)29-21(32)19(22(33)30(29)18-11-7-16(25)8-12-18)20(31)13-1-3-14(4-2-13)23(26,27)28/h1-12,32H
n/an/a 1.50E+4n/an/an/an/an/an/a
Wyeth
Curated by ChEMBL
Assay Description
Inhibition of MurB activity
J Med Chem 49: 6027-36 (2006)
Article DOI: 10.1021/jm060499t
BindingDB Entry DOI: 10.7270/Q22V2FRV
MurB (E. coli)
(Escherichia coli K-12 (Enterobacteria))
BDBM50411199
(CHEMBL2096737)
Show SMILES Oc1c(C(=O)c2ccc(cc2)C(F)(F)F)c(=O)n(-c2ccc(Cl)cc2)n1-c1ccc(Cl)cc1
Show InChI InChI=1S/C23H13Cl2F3N2O3/c24-15-5-9-17(10-6-15)29-21(32)19(22(33)30(29)18-11-7-16(25)8-12-18)20(31)13-1-3-14(4-2-13)23(26,27)28/h1-12,32H
n/an/a 5.90E+3n/an/an/an/an/an/a
Wyeth
Curated by ChEMBL
Assay Description
Inhibition of MurB activity
J Med Chem 49: 6027-36 (2006)
Article DOI: 10.1021/jm060499t
BindingDB Entry DOI: 10.7270/Q22V2FRV