BDBM50411429 CHEMBL235789
SMILES: Clc1ccc(CN2CCNCC2)cc1C(=O)NCC12CC3CC(CC(C3)C1)C2
InChI Key: InChIKey=VGXCGVFXXLXIIY-UHFFFAOYSA-N
Data: 2 IC50  1 Kd
Activity Spreadsheet -- Enzyme Inhibition Constant Data from BindingDB
Found 3 hits for monomerid = 50411429
Trg + Lig
Ki
nM
ΔG°
kcal/mole
IC50
nM
Kd
nM
EC50/IC50
nM
koff
s-1
kon
M-1s-1
pHTemp
°C
P2X purinoceptor 7
(Rattus norvegicus (Rat))
BDBM50411429
(CHEMBL235789)
Show SMILES Clc1ccc(CN2CCNCC2)cc1C(=O)NCC12CC3CC(CC(C3)C1)C2 |TLB:17:18:21:25.23.24,THB:23:22:19:25.24.26,23:24:21.22.27:19,26:24:21:27.18.19,26:18:21:25.23.24|
Show InChI InChI=1S/C23H32ClN3O/c24-21-2-1-16(14-27-5-3-25-4-6-27)10-20(21)22(28)26-15-23-11-17-7-18(12-23)9-19(8-17)13-23/h1-2,10,17-19,25H,3-9,11-15H2,(H,26,28)
n/an/a 398n/an/an/an/an/an/a
AstraZeneca R&D Charnwood
Curated by ChEMBL
Assay Description
Antagonist activity at rat P2X7 receptor transfected in HEK cells assessed as inhibition of benzylATP-induced changes in plasma membrane pore formati...
J Med Chem 50: 5882-5 (2007)
Article DOI: 10.1021/jm700949w
BindingDB Entry DOI: 10.7270/Q2HQ3ZM9
Bile salt export pump
(Homo sapiens (Human))
BDBM50411429
(CHEMBL235789)
Show SMILES Clc1ccc(CN2CCNCC2)cc1C(=O)NCC12CC3CC(CC(C3)C1)C2 |TLB:17:18:21:25.23.24,THB:23:22:19:25.24.26,23:24:21.22.27:19,26:24:21:27.18.19,26:18:21:25.23.24|
Show InChI InChI=1S/C23H32ClN3O/c24-21-2-1-16(14-27-5-3-25-4-6-27)10-20(21)22(28)26-15-23-11-17-7-18(12-23)9-19(8-17)13-23/h1-2,10,17-19,25H,3-9,11-15H2,(H,26,28)
n/an/a 1.24E+5n/an/an/an/an/an/a
AstraZeneca
Curated by ChEMBL
Assay Description
Inhibition of human BSEP expressed in baculovirus transfected fall armyworm Sf21 cell membranes vesicles assessed as reduction in ATP-dependent [3H]-...
Drug Metab Dispos 40: 2332-41 (2012)
Article DOI: 10.1124/dmd.112.047068
BindingDB Entry DOI: 10.7270/Q2ZP488M
P2X purinoceptor 7
(Homo sapiens (Human))
BDBM50411429
(CHEMBL235789)
Show SMILES Clc1ccc(CN2CCNCC2)cc1C(=O)NCC12CC3CC(CC(C3)C1)C2 |TLB:17:18:21:25.23.24,THB:23:22:19:25.24.26,23:24:21.22.27:19,26:24:21:27.18.19,26:18:21:25.23.24|
Show InChI InChI=1S/C23H32ClN3O/c24-21-2-1-16(14-27-5-3-25-4-6-27)10-20(21)22(28)26-15-23-11-17-7-18(12-23)9-19(8-17)13-23/h1-2,10,17-19,25H,3-9,11-15H2,(H,26,28)
n/an/an/a 10n/an/an/an/an/a
AstraZeneca R&D Charnwood
Curated by ChEMBL
Assay Description
Antagonist activity at human P2X7 receptor transfected in THP1 cells assessed as inhibition of benzoyl-ATP-induced changes in plasma membrane pore fo...
J Med Chem 50: 5882-5 (2007)
Article DOI: 10.1021/jm700949w
BindingDB Entry DOI: 10.7270/Q2HQ3ZM9