BDBM50411475 CHEMBL237496
SMILES: CC1(CC(O)(Cc2ccnc3ccccc23)C(F)(F)F)CCCc2ccccc12
InChI Key: InChIKey=XULBSIKQABBRCP-UHFFFAOYSA-N
Data: 4 IC50  2 EC50
Activity Spreadsheet -- Enzyme Inhibition Constant Data from BindingDB
Found 6 hits for monomerid = 50411475
Trg + Lig
Ki
nM
ΔG°
kcal/mole
IC50
nM
Kd
nM
EC50/IC50
nM
koff
s-1
kon
M-1s-1
pHTemp
°C
Glucocorticoid receptor
(Homo sapiens (Human))
BDBM50411475
(CHEMBL237496)
Show SMILES CC1(CC(O)(Cc2ccnc3ccccc23)C(F)(F)F)CCCc2ccccc12
Show InChI InChI=1S/C24H24F3NO/c1-22(13-6-8-17-7-2-4-10-20(17)22)16-23(29,24(25,26)27)15-18-12-14-28-21-11-5-3-9-19(18)21/h2-5,7,9-12,14,29H,6,8,13,15-16H2,1H3
n/an/an/an/a>1.00E+4n/an/an/an/a
GlaxoSmithKline Medicines Research Centre
Curated by ChEMBL
Assay Description
Agonist activity at glucocorticoid receptor in human A549 cells by MMTV transactivation assay
J Med Chem 50: 6519-34 (2007)
Article DOI: 10.1021/jm070778w
BindingDB Entry DOI: 10.7270/Q21R6RRR
Glucocorticoid receptor
(Homo sapiens (Human))
BDBM50411475
(CHEMBL237496)
Show SMILES CC1(CC(O)(Cc2ccnc3ccccc23)C(F)(F)F)CCCc2ccccc12
Show InChI InChI=1S/C24H24F3NO/c1-22(13-6-8-17-7-2-4-10-20(17)22)16-23(29,24(25,26)27)15-18-12-14-28-21-11-5-3-9-19(18)21/h2-5,7,9-12,14,29H,6,8,13,15-16H2,1H3
n/an/a 24.0n/an/an/an/an/an/a
GlaxoSmithKline Medicines Research Centre
Curated by ChEMBL
Assay Description
Displacement of fluorescent labeled Dexamethasone from glucocorticoid receptor
J Med Chem 50: 6519-34 (2007)
Article DOI: 10.1021/jm070778w
BindingDB Entry DOI: 10.7270/Q21R6RRR
Glucocorticoid receptor
(Homo sapiens (Human))
BDBM50411475
(CHEMBL237496)
Show SMILES CC1(CC(O)(Cc2ccnc3ccccc23)C(F)(F)F)CCCc2ccccc12
Show InChI InChI=1S/C24H24F3NO/c1-22(13-6-8-17-7-2-4-10-20(17)22)16-23(29,24(25,26)27)15-18-12-14-28-21-11-5-3-9-19(18)21/h2-5,7,9-12,14,29H,6,8,13,15-16H2,1H3
n/an/a 7.08n/an/an/an/an/an/a
GlaxoSmithKline Medicines Research Centre
Curated by ChEMBL
Assay Description
Agonist activity at glucocorticoid receptor in human A549 cells by NF-kappaB transrepression assay
J Med Chem 50: 6519-34 (2007)
Article DOI: 10.1021/jm070778w
BindingDB Entry DOI: 10.7270/Q21R6RRR
Glucocorticoid receptor
(Homo sapiens (Human))
BDBM50411475
(CHEMBL237496)
Show SMILES CC1(CC(O)(Cc2ccnc3ccccc23)C(F)(F)F)CCCc2ccccc12
Show InChI InChI=1S/C24H24F3NO/c1-22(13-6-8-17-7-2-4-10-20(17)22)16-23(29,24(25,26)27)15-18-12-14-28-21-11-5-3-9-19(18)21/h2-5,7,9-12,14,29H,6,8,13,15-16H2,1H3
n/an/a>1.00E+4n/an/an/an/an/an/a
GlaxoSmithKline Medicines Research Centre
Curated by ChEMBL
Assay Description
Agonist activity at glucocorticoid receptor in human A549 cells by NF-kappaB transrepression assay
J Med Chem 50: 6519-34 (2007)
Article DOI: 10.1021/jm070778w
BindingDB Entry DOI: 10.7270/Q21R6RRR
Glucocorticoid receptor
(Homo sapiens (Human))
BDBM50411475
(CHEMBL237496)
Show SMILES CC1(CC(O)(Cc2ccnc3ccccc23)C(F)(F)F)CCCc2ccccc12
Show InChI InChI=1S/C24H24F3NO/c1-22(13-6-8-17-7-2-4-10-20(17)22)16-23(29,24(25,26)27)15-18-12-14-28-21-11-5-3-9-19(18)21/h2-5,7,9-12,14,29H,6,8,13,15-16H2,1H3
n/an/an/an/a 12.9n/an/an/an/a
GlaxoSmithKline Medicines Research Centre
Curated by ChEMBL
Assay Description
Agonist activity at glucocorticoid receptor in human A549 cells by MMTV transactivation assay
J Med Chem 50: 6519-34 (2007)
Article DOI: 10.1021/jm070778w
BindingDB Entry DOI: 10.7270/Q21R6RRR
Glucocorticoid receptor
(Homo sapiens (Human))
BDBM50411475
(CHEMBL237496)
Show SMILES CC1(CC(O)(Cc2ccnc3ccccc23)C(F)(F)F)CCCc2ccccc12
Show InChI InChI=1S/C24H24F3NO/c1-22(13-6-8-17-7-2-4-10-20(17)22)16-23(29,24(25,26)27)15-18-12-14-28-21-11-5-3-9-19(18)21/h2-5,7,9-12,14,29H,6,8,13,15-16H2,1H3
n/an/a 15.1n/an/an/an/an/an/a
GlaxoSmithKline Medicines Research Centre
Curated by ChEMBL
Assay Description
Displacement of fluorescent labeled Dexamethasone from glucocorticoid receptor
J Med Chem 50: 6519-34 (2007)
Article DOI: 10.1021/jm070778w
BindingDB Entry DOI: 10.7270/Q21R6RRR