null
SMILES: CC1(CC(O)(CNc2cccc3ncccc23)C(F)(F)F)CCCc2ccccc12
InChI Key: InChIKey=IDXIGNMGABVLIG-UHFFFAOYSA-N
Activity Spreadsheet -- Enzyme Inhibition Constant Data from BindingDB
Found 3 hits for monomerid = 50411477
Trg + Lig
Ki
nM
ΔG°
kcal/mole
IC50
nM
Kd
nM
EC50/IC50
nM
koff
s-1
kon
M-1s-1
pHTemp
°C
Glucocorticoid receptor
(Homo sapiens (Human))
BDBM50411477
(CHEMBL393551)
Show SMILES CC1(CC(O)(CNc2cccc3ncccc23)C(F)(F)F)CCCc2ccccc12
Show InChI InChI=1S/C24H25F3N2O/c1-22(13-5-8-17-7-2-3-10-19(17)22)15-23(30,24(25,26)27)16-29-21-12-4-11-20-18(21)9-6-14-28-20/h2-4,6-7,9-12,14,29-30H,5,8,13,15-16H2,1H3
n/an/an/an/a 13.5n/an/an/an/a
GlaxoSmithKline Medicines Research Centre
Curated by ChEMBL
Assay Description
Agonist activity at glucocorticoid receptor in human A549 cells by MMTV transactivation assay
J Med Chem 50: 6519-34 (2007)
Article DOI: 10.1021/jm070778w
BindingDB Entry DOI: 10.7270/Q21R6RRR
Glucocorticoid receptor
(Homo sapiens (Human))
BDBM50411477
(CHEMBL393551)
Show SMILES CC1(CC(O)(CNc2cccc3ncccc23)C(F)(F)F)CCCc2ccccc12
Show InChI InChI=1S/C24H25F3N2O/c1-22(13-5-8-17-7-2-3-10-19(17)22)15-23(30,24(25,26)27)16-29-21-12-4-11-20-18(21)9-6-14-28-20/h2-4,6-7,9-12,14,29-30H,5,8,13,15-16H2,1H3
n/an/a 3.09n/an/an/an/an/an/a
GlaxoSmithKline Medicines Research Centre
Curated by ChEMBL
Assay Description
Agonist activity at glucocorticoid receptor in human A549 cells by NF-kappaB transrepression assay
J Med Chem 50: 6519-34 (2007)
Article DOI: 10.1021/jm070778w
BindingDB Entry DOI: 10.7270/Q21R6RRR
Glucocorticoid receptor
(Homo sapiens (Human))
BDBM50411477
(CHEMBL393551)
Show SMILES CC1(CC(O)(CNc2cccc3ncccc23)C(F)(F)F)CCCc2ccccc12
Show InChI InChI=1S/C24H25F3N2O/c1-22(13-5-8-17-7-2-3-10-19(17)22)15-23(30,24(25,26)27)16-29-21-12-4-11-20-18(21)9-6-14-28-20/h2-4,6-7,9-12,14,29-30H,5,8,13,15-16H2,1H3
n/an/a 6.31n/an/an/an/an/an/a
GlaxoSmithKline Medicines Research Centre
Curated by ChEMBL
Assay Description
Displacement of fluorescent labeled Dexamethasone from glucocorticoid receptor
J Med Chem 50: 6519-34 (2007)
Article DOI: 10.1021/jm070778w
BindingDB Entry DOI: 10.7270/Q21R6RRR