null
SMILES: CCC1(CC(O)(Cc2ccnc3ccccc23)C(F)(F)F)CCCc2ccccc12
InChI Key: InChIKey=AKRFUARLUXZAGZ-UHFFFAOYSA-N
Activity Spreadsheet -- Enzyme Inhibition Constant Data from BindingDB
Found 10 hits for monomerid = 50411480
Trg + Lig
Ki
nM
ΔG°
kcal/mole
IC50
nM
Kd
nM
EC50/IC50
nM
koff
s-1
kon
M-1s-1
pHTemp
°C
Glucocorticoid receptor
(Homo sapiens (Human))
BDBM50411480
(CHEMBL398572)
Show SMILES CCC1(CC(O)(Cc2ccnc3ccccc23)C(F)(F)F)CCCc2ccccc12
Show InChI InChI=1S/C25H26F3NO/c1-2-23(14-7-9-18-8-3-5-11-21(18)23)17-24(30,25(26,27)28)16-19-13-15-29-22-12-6-4-10-20(19)22/h3-6,8,10-13,15,30H,2,7,9,14,16-17H2,1H3
n/an/a 10n/an/an/an/an/an/a
GlaxoSmithKline Medicines Research Centre
Curated by ChEMBL
Assay Description
Displacement of fluorescent labeled Dexamethasone from glucocorticoid receptor
J Med Chem 50: 6519-34 (2007)
Article DOI: 10.1021/jm070778w
BindingDB Entry DOI: 10.7270/Q21R6RRR
Glucocorticoid receptor
(Homo sapiens (Human))
BDBM50411480
(CHEMBL398572)
Show SMILES CCC1(CC(O)(Cc2ccnc3ccccc23)C(F)(F)F)CCCc2ccccc12
Show InChI InChI=1S/C25H26F3NO/c1-2-23(14-7-9-18-8-3-5-11-21(18)23)17-24(30,25(26,27)28)16-19-13-15-29-22-12-6-4-10-20(19)22/h3-6,8,10-13,15,30H,2,7,9,14,16-17H2,1H3
n/an/a 4.90n/an/an/an/an/an/a
GlaxoSmithKline Medicines Research Centre
Curated by ChEMBL
Assay Description
Agonist activity at glucocorticoid receptor in human A549 cells by NF-kappaB transrepression assay
J Med Chem 50: 6519-34 (2007)
Article DOI: 10.1021/jm070778w
BindingDB Entry DOI: 10.7270/Q21R6RRR
Glucocorticoid receptor
(Homo sapiens (Human))
BDBM50411480
(CHEMBL398572)
Show SMILES CCC1(CC(O)(Cc2ccnc3ccccc23)C(F)(F)F)CCCc2ccccc12
Show InChI InChI=1S/C25H26F3NO/c1-2-23(14-7-9-18-8-3-5-11-21(18)23)17-24(30,25(26,27)28)16-19-13-15-29-22-12-6-4-10-20(19)22/h3-6,8,10-13,15,30H,2,7,9,14,16-17H2,1H3
n/an/a 1.58n/an/an/an/an/an/a
GlaxoSmithKline Medicines Research Centre
Curated by ChEMBL
Assay Description
Agonist activity at glucocorticoid receptor in human A549 cells by NF-kappaB transrepression assay
J Med Chem 50: 6519-34 (2007)
Article DOI: 10.1021/jm070778w
BindingDB Entry DOI: 10.7270/Q21R6RRR
Glucocorticoid receptor
(Homo sapiens (Human))
BDBM50411480
(CHEMBL398572)
Show SMILES CCC1(CC(O)(Cc2ccnc3ccccc23)C(F)(F)F)CCCc2ccccc12
Show InChI InChI=1S/C25H26F3NO/c1-2-23(14-7-9-18-8-3-5-11-21(18)23)17-24(30,25(26,27)28)16-19-13-15-29-22-12-6-4-10-20(19)22/h3-6,8,10-13,15,30H,2,7,9,14,16-17H2,1H3
n/an/a 5.01E+3n/an/an/an/an/an/a
GlaxoSmithKline Medicines Research Centre
Curated by ChEMBL
Assay Description
Antagonist activity at glucocorticoid receptor in human A549 cells transfected with MMTV luciferase reporter gene assessed as inhibition of dexametha...
J Med Chem 50: 6519-34 (2007)
Article DOI: 10.1021/jm070778w
BindingDB Entry DOI: 10.7270/Q21R6RRR
Glucocorticoid receptor
(Homo sapiens (Human))
BDBM50411480
(CHEMBL398572)
Show SMILES CCC1(CC(O)(Cc2ccnc3ccccc23)C(F)(F)F)CCCc2ccccc12
Show InChI InChI=1S/C25H26F3NO/c1-2-23(14-7-9-18-8-3-5-11-21(18)23)17-24(30,25(26,27)28)16-19-13-15-29-22-12-6-4-10-20(19)22/h3-6,8,10-13,15,30H,2,7,9,14,16-17H2,1H3
n/an/a 33.1n/an/an/an/an/an/a
GlaxoSmithKline Medicines Research Centre
Curated by ChEMBL
Assay Description
Displacement of fluorescent labeled Dexamethasone from glucocorticoid receptor
J Med Chem 50: 6519-34 (2007)
Article DOI: 10.1021/jm070778w
BindingDB Entry DOI: 10.7270/Q21R6RRR
Glucocorticoid receptor
(Homo sapiens (Human))
BDBM50411480
(CHEMBL398572)
Show SMILES CCC1(CC(O)(Cc2ccnc3ccccc23)C(F)(F)F)CCCc2ccccc12
Show InChI InChI=1S/C25H26F3NO/c1-2-23(14-7-9-18-8-3-5-11-21(18)23)17-24(30,25(26,27)28)16-19-13-15-29-22-12-6-4-10-20(19)22/h3-6,8,10-13,15,30H,2,7,9,14,16-17H2,1H3
n/an/a 275n/an/an/an/an/an/a
GlaxoSmithKline Medicines Research Centre
Curated by ChEMBL
Assay Description
Agonist activity at glucocorticoid receptor in human A549 cells by NF-kappaB transrepression assay
J Med Chem 50: 6519-34 (2007)
Article DOI: 10.1021/jm070778w
BindingDB Entry DOI: 10.7270/Q21R6RRR
Glucocorticoid receptor
(Homo sapiens (Human))
BDBM50411480
(CHEMBL398572)
Show SMILES CCC1(CC(O)(Cc2ccnc3ccccc23)C(F)(F)F)CCCc2ccccc12
Show InChI InChI=1S/C25H26F3NO/c1-2-23(14-7-9-18-8-3-5-11-21(18)23)17-24(30,25(26,27)28)16-19-13-15-29-22-12-6-4-10-20(19)22/h3-6,8,10-13,15,30H,2,7,9,14,16-17H2,1H3
n/an/a 15.1n/an/an/an/an/an/a
GlaxoSmithKline Medicines Research Centre
Curated by ChEMBL
Assay Description
Displacement of fluorescent labeled Dexamethasone from glucocorticoid receptor
J Med Chem 50: 6519-34 (2007)
Article DOI: 10.1021/jm070778w
BindingDB Entry DOI: 10.7270/Q21R6RRR
Glucocorticoid receptor
(Homo sapiens (Human))
BDBM50411480
(CHEMBL398572)
Show SMILES CCC1(CC(O)(Cc2ccnc3ccccc23)C(F)(F)F)CCCc2ccccc12
Show InChI InChI=1S/C25H26F3NO/c1-2-23(14-7-9-18-8-3-5-11-21(18)23)17-24(30,25(26,27)28)16-19-13-15-29-22-12-6-4-10-20(19)22/h3-6,8,10-13,15,30H,2,7,9,14,16-17H2,1H3
n/an/an/an/a>1.00E+4n/an/an/an/a
GlaxoSmithKline Medicines Research Centre
Curated by ChEMBL
Assay Description
Agonist activity at glucocorticoid receptor in human A549 cells by MMTV transactivation assay
J Med Chem 50: 6519-34 (2007)
Article DOI: 10.1021/jm070778w
BindingDB Entry DOI: 10.7270/Q21R6RRR
Glucocorticoid receptor
(Homo sapiens (Human))
BDBM50411480
(CHEMBL398572)
Show SMILES CCC1(CC(O)(Cc2ccnc3ccccc23)C(F)(F)F)CCCc2ccccc12
Show InChI InChI=1S/C25H26F3NO/c1-2-23(14-7-9-18-8-3-5-11-21(18)23)17-24(30,25(26,27)28)16-19-13-15-29-22-12-6-4-10-20(19)22/h3-6,8,10-13,15,30H,2,7,9,14,16-17H2,1H3
n/an/an/an/a>1.00E+3n/an/an/an/a
GlaxoSmithKline Medicines Research Centre
Curated by ChEMBL
Assay Description
Agonist activity at glucocorticoid receptor in human A549 cells by MMTV transactivation assay
J Med Chem 50: 6519-34 (2007)
Article DOI: 10.1021/jm070778w
BindingDB Entry DOI: 10.7270/Q21R6RRR
Glucocorticoid receptor
(Homo sapiens (Human))
BDBM50411480
(CHEMBL398572)
Show SMILES CCC1(CC(O)(Cc2ccnc3ccccc23)C(F)(F)F)CCCc2ccccc12
Show InChI InChI=1S/C25H26F3NO/c1-2-23(14-7-9-18-8-3-5-11-21(18)23)17-24(30,25(26,27)28)16-19-13-15-29-22-12-6-4-10-20(19)22/h3-6,8,10-13,15,30H,2,7,9,14,16-17H2,1H3
n/an/an/an/a 38.0n/an/an/an/a
GlaxoSmithKline Medicines Research Centre
Curated by ChEMBL
Assay Description
Agonist activity at glucocorticoid receptor in human A549 cells by MMTV transactivation assay
J Med Chem 50: 6519-34 (2007)
Article DOI: 10.1021/jm070778w
BindingDB Entry DOI: 10.7270/Q21R6RRR