BDBM50411661 CHEMBL257369
SMILES: Cc1ccc2c(cccc2n1)-c1nnc(SCCCCN2CCc3cc4nc(oc4c(Br)c3CC2)C(F)(F)F)n1C
InChI Key: InChIKey=VTSMNPQRBXHIOD-UHFFFAOYSA-N
Data: 3 KI  1 IC50
Activity Spreadsheet -- Enzyme Inhibition Constant Data from BindingDB
Found 4 hits for monomerid = 50411661
Trg + Lig
Ki
nM
ΔG°
kcal/mole
IC50
nM
Kd
nM
EC50/IC50
nM
koff
s-1
kon
M-1s-1
pHTemp
°C
D(3) dopamine receptor
(Homo sapiens (Human))
BDBM50411661
(CHEMBL257369)
Show SMILES Cc1ccc2c(cccc2n1)-c1nnc(SCCCCN2CCc3cc4nc(oc4c(Br)c3CC2)C(F)(F)F)n1C
Show InChI InChI=1S/C29H28BrF3N6OS/c1-17-8-9-20-21(6-5-7-22(20)34-17)26-36-37-28(38(26)2)41-15-4-3-12-39-13-10-18-16-23-25(24(30)19(18)11-14-39)40-27(35-23)29(31,32)33/h5-9,16H,3-4,10-15H2,1-2H3
19.9n/an/an/an/an/an/an/an/a
GlaxoSmithKline
Curated by ChEMBL
Assay Description
Antagonist activity at human dopamine D3 receptor by cell based GTPgammaS binding assay
Bioorg Med Chem Lett 18: 901-7 (2008)
Article DOI: 10.1016/j.bmcl.2007.12.066
BindingDB Entry DOI: 10.7270/Q2MK6F32
D(2) dopamine receptor
(Homo sapiens (Human))
BDBM50411661
(CHEMBL257369)
Show SMILES Cc1ccc2c(cccc2n1)-c1nnc(SCCCCN2CCc3cc4nc(oc4c(Br)c3CC2)C(F)(F)F)n1C
Show InChI InChI=1S/C29H28BrF3N6OS/c1-17-8-9-20-21(6-5-7-22(20)34-17)26-36-37-28(38(26)2)41-15-4-3-12-39-13-10-18-16-23-25(24(30)19(18)11-14-39)40-27(35-23)29(31,32)33/h5-9,16H,3-4,10-15H2,1-2H3
Reactome pathway
1.00E+3n/an/an/an/an/an/an/an/a
GlaxoSmithKline
Curated by ChEMBL
Assay Description
Antagonist activity at dopamine D2 receptor by GTPgammaS binding assay
Bioorg Med Chem Lett 18: 901-7 (2008)
Article DOI: 10.1016/j.bmcl.2007.12.066
BindingDB Entry DOI: 10.7270/Q2MK6F32
Histamine H1 receptor
(Homo sapiens (Human))
BDBM50411661
(CHEMBL257369)
Show SMILES Cc1ccc2c(cccc2n1)-c1nnc(SCCCCN2CCc3cc4nc(oc4c(Br)c3CC2)C(F)(F)F)n1C
Show InChI InChI=1S/C29H28BrF3N6OS/c1-17-8-9-20-21(6-5-7-22(20)34-17)26-36-37-28(38(26)2)41-15-4-3-12-39-13-10-18-16-23-25(24(30)19(18)11-14-39)40-27(35-23)29(31,32)33/h5-9,16H,3-4,10-15H2,1-2H3
Reactome pathway
1.26E+3n/an/an/an/an/an/an/an/a
GlaxoSmithKline
Curated by ChEMBL
Assay Description
Antagonist activity at histamine H1 receptor by FLIPR assay
Bioorg Med Chem Lett 18: 901-7 (2008)
Article DOI: 10.1016/j.bmcl.2007.12.066
BindingDB Entry DOI: 10.7270/Q2MK6F32
Potassium voltage-gated channel subfamily H member 2
(Homo sapiens (Human))
BDBM50411661
(CHEMBL257369)
Show SMILES Cc1ccc2c(cccc2n1)-c1nnc(SCCCCN2CCc3cc4nc(oc4c(Br)c3CC2)C(F)(F)F)n1C
Show InChI InChI=1S/C29H28BrF3N6OS/c1-17-8-9-20-21(6-5-7-22(20)34-17)26-36-37-28(38(26)2)41-15-4-3-12-39-13-10-18-16-23-25(24(30)19(18)11-14-39)40-27(35-23)29(31,32)33/h5-9,16H,3-4,10-15H2,1-2H3
Reactome pathway
n/an/a 251n/an/an/an/an/an/a
GlaxoSmithKline
Curated by ChEMBL
Assay Description
Displacement of [3H]Dofetilide from human ERG
Bioorg Med Chem Lett 18: 901-7 (2008)
Article DOI: 10.1016/j.bmcl.2007.12.066
BindingDB Entry DOI: 10.7270/Q2MK6F32