BDBM50411703 CHEMBL402826
SMILES: CCCc1nc2cc3CCN(CCCSc4nnc(-c5cccc6nc(C)ccc56)n4C)CCc3cc2o1
InChI Key: InChIKey=UKHPZHQUPSAUMR-UHFFFAOYSA-N
Data: 3 KI  1 IC50
Activity Spreadsheet -- Enzyme Inhibition Constant Data from BindingDB
Found 4 hits for monomerid = 50411703
Trg + Lig
Ki
nM
ΔG°
kcal/mole
IC50
nM
Kd
nM
EC50/IC50
nM
koff
s-1
kon
M-1s-1
pHTemp
°C
D(3) dopamine receptor
(Homo sapiens (Human))
BDBM50411703
(CHEMBL402826)
Show SMILES CCCc1nc2cc3CCN(CCCSc4nnc(-c5cccc6nc(C)ccc56)n4C)CCc3cc2o1
Show InChI InChI=1S/C30H34N6OS/c1-4-7-28-32-26-18-21-12-15-36(16-13-22(21)19-27(26)37-28)14-6-17-38-30-34-33-29(35(30)3)24-8-5-9-25-23(24)11-10-20(2)31-25/h5,8-11,18-19H,4,6-7,12-17H2,1-3H3
3.98n/an/an/an/an/an/an/an/a
GlaxoSmithKline
Curated by ChEMBL
Assay Description
Antagonist activity at human dopamine D3 receptor by cell based GTPgammaS binding assay
Bioorg Med Chem Lett 18: 901-7 (2008)
Article DOI: 10.1016/j.bmcl.2007.12.066
BindingDB Entry DOI: 10.7270/Q2MK6F32
D(2) dopamine receptor
(Homo sapiens (Human))
BDBM50411703
(CHEMBL402826)
Show SMILES CCCc1nc2cc3CCN(CCCSc4nnc(-c5cccc6nc(C)ccc56)n4C)CCc3cc2o1
Show InChI InChI=1S/C30H34N6OS/c1-4-7-28-32-26-18-21-12-15-36(16-13-22(21)19-27(26)37-28)14-6-17-38-30-34-33-29(35(30)3)24-8-5-9-25-23(24)11-10-20(2)31-25/h5,8-11,18-19H,4,6-7,12-17H2,1-3H3
Reactome pathway
>631n/an/an/an/an/an/an/an/a
GlaxoSmithKline
Curated by ChEMBL
Assay Description
Antagonist activity at dopamine D2 receptor by GTPgammaS binding assay
Bioorg Med Chem Lett 18: 901-7 (2008)
Article DOI: 10.1016/j.bmcl.2007.12.066
BindingDB Entry DOI: 10.7270/Q2MK6F32
Histamine H1 receptor
(Homo sapiens (Human))
BDBM50411703
(CHEMBL402826)
Show SMILES CCCc1nc2cc3CCN(CCCSc4nnc(-c5cccc6nc(C)ccc56)n4C)CCc3cc2o1
Show InChI InChI=1S/C30H34N6OS/c1-4-7-28-32-26-18-21-12-15-36(16-13-22(21)19-27(26)37-28)14-6-17-38-30-34-33-29(35(30)3)24-8-5-9-25-23(24)11-10-20(2)31-25/h5,8-11,18-19H,4,6-7,12-17H2,1-3H3
Reactome pathway
>2.51E+3n/an/an/an/an/an/an/an/a
GlaxoSmithKline
Curated by ChEMBL
Assay Description
Antagonist activity at histamine H1 receptor by FLIPR assay
Bioorg Med Chem Lett 18: 901-7 (2008)
Article DOI: 10.1016/j.bmcl.2007.12.066
BindingDB Entry DOI: 10.7270/Q2MK6F32
Potassium voltage-gated channel subfamily H member 2
(Homo sapiens (Human))
BDBM50411703
(CHEMBL402826)
Show SMILES CCCc1nc2cc3CCN(CCCSc4nnc(-c5cccc6nc(C)ccc56)n4C)CCc3cc2o1
Show InChI InChI=1S/C30H34N6OS/c1-4-7-28-32-26-18-21-12-15-36(16-13-22(21)19-27(26)37-28)14-6-17-38-30-34-33-29(35(30)3)24-8-5-9-25-23(24)11-10-20(2)31-25/h5,8-11,18-19H,4,6-7,12-17H2,1-3H3
Reactome pathway
n/an/a 631n/an/an/an/an/an/a
GlaxoSmithKline
Curated by ChEMBL
Assay Description
Displacement of [3H]Dofetilide from human ERG
Bioorg Med Chem Lett 18: 901-7 (2008)
Article DOI: 10.1016/j.bmcl.2007.12.066
BindingDB Entry DOI: 10.7270/Q2MK6F32