null
SMILES: CC(C)[C@@H]1CN(C1=O)C1=CC[C@]2(C)[C@H]3CC[C@@]4(C)[C@@H](C[C@H](O)[C@@H]4[C@H](C)N(C)C)[C@@H]3CC[C@H]2C1=O
InChI Key: InChIKey=UOUGFQVCCBWYHB-FDBJBNRWSA-N
Activity Spreadsheet -- Enzyme Inhibition Constant Data from BindingDB
Found 1 hit for monomerid = 50412083
Trg + Lig
Ki
nM
ΔG°
kcal/mole
IC50
nM
Kd
nM
EC50/IC50
nM
koff
s-1
kon
M-1s-1
pHTemp
°C
7-dehydrocholesterol reductase
(Homo sapiens (Human))
BDBM50412083
(CHEMBL458033)
Show SMILES CC(C)[C@@H]1CN(C1=O)C1=CC[C@]2(C)[C@H]3CC[C@@]4(C)[C@@H](C[C@H](O)[C@@H]4[C@H](C)N(C)C)[C@@H]3CC[C@H]2C1=O |r,t:9|
Show InChI InChI=1S/C29H46N2O3/c1-16(2)19-15-31(27(19)34)23-11-13-28(4)20-10-12-29(5)22(18(20)8-9-21(28)26(23)33)14-24(32)25(29)17(3)30(6)7/h11,16-22,24-25,32H,8-10,12-15H2,1-7H3/t17-,18+,19-,20-,21-,22-,24-,25-,28+,29-/m0/s1
Reactome pathway
n/an/a 3.50E+3n/an/an/an/an/an/a
University of Illinois at Chicago
Curated by ChEMBL
Assay Description
Displacement of [3H]tamoxifen from antiestrogen binding site in Sprague-Dawley rat liver by liquid scintillation counting
J Nat Prod 61: 1257-62 (1998)
Article DOI: 10.1021/np980162x
BindingDB Entry DOI: 10.7270/Q2B27WJ0