BDBM50412236 CHEMBL494282
SMILES: CC(C)COc1ccc(Cl)cc1Cn1nc(cc1C)C(=O)Nc1ccc(CN2CCCC2)cc1
InChI Key: InChIKey=MXQPTNWWWFZUHQ-UHFFFAOYSA-N
Data: 1 IC50
Activity Spreadsheet -- Enzyme Inhibition Constant Data from BindingDB
Found 1 hit for monomerid = 50412236
Trg + Lig
Ki
nM
ΔG°
kcal/mole
IC50
nM
Kd
nM
EC50/IC50
nM
koff
s-1
kon
M-1s-1
pHTemp
°C
Prostaglandin E2 receptor EP1 subtype (EP1)
(Homo sapiens (Human))
BDBM50412236
(CHEMBL494282)
Show SMILES CC(C)COc1ccc(Cl)cc1Cn1nc(cc1C)C(=O)Nc1ccc(CN2CCCC2)cc1
Show InChI InChI=1S/C27H33ClN4O2/c1-19(2)18-34-26-11-8-23(28)15-22(26)17-32-20(3)14-25(30-32)27(33)29-24-9-6-21(7-10-24)16-31-12-4-5-13-31/h6-11,14-15,19H,4-5,12-13,16-18H2,1-3H3,(H,29,33)
n/an/a 6.31n/an/an/an/an/an/a
GlaxoSmithKline
Curated by ChEMBL
Assay Description
Displacement of [H3PGE2 from human EP1 receptor expressed in CHOK1 cells
Bioorg Med Chem Lett 18: 4027-32 (2008)
Article DOI: 10.1016/j.bmcl.2008.05.118
BindingDB Entry DOI: 10.7270/Q2NC62F7