BDBM50412351 CHEMBL499342
SMILES: OC(=O)c1ccccc1NC(=O)c1cc(O)c(Br)c(Oc2ccccc2)c1
InChI Key: InChIKey=KOKRWKUHMXWOBY-UHFFFAOYSA-N
Data: 1 IC50
Activity Spreadsheet -- Enzyme Inhibition Constant Data from BindingDB
Found 1 hit for monomerid = 50412351
Trg + Lig
Ki
nM
ΔG°
kcal/mole
IC50
nM
Kd
nM
EC50/IC50
nM
koff
s-1
kon
M-1s-1
pHTemp
°C
beta-Ketoacyl-ACP Synthase III (FabH)
(Enterococcus faecalis)
BDBM50412351
(CHEMBL499342)
Show SMILES OC(=O)c1ccccc1NC(=O)c1cc(O)c(Br)c(Oc2ccccc2)c1
Show InChI InChI=1S/C20H14BrNO5/c21-18-16(23)10-12(11-17(18)27-13-6-2-1-3-7-13)19(24)22-15-9-5-4-8-14(15)20(25)26/h1-11,23H,(H,22,24)(H,25,26)
n/an/a 62.1n/an/an/an/an/an/a
Shri G.S. Institute of Technology and Science
Curated by ChEMBL
Assay Description
Inhibition of Enterococcus faecalis FabH by FabD/FabH coupled assay
Eur J Med Chem 43: 1071-80 (2008)
Article DOI: 10.1016/j.ejmech.2007.06.018
BindingDB Entry DOI: 10.7270/Q2GQ700V