BDBM50412413 CHEMBL486442
SMILES: CCn1ncc2c(NC3CCOCC3)c(cnc12)C(=O)N(C)Cc1ccccc1
InChI Key: InChIKey=LXMPLULACZGKHT-UHFFFAOYSA-N
Data: 1 IC50
Activity Spreadsheet -- Enzyme Inhibition Constant Data from BindingDB
Found 1 hit for monomerid = 50412413
Trg + Lig
Ki
nM
ΔG°
kcal/mole
IC50
nM
Kd
nM
EC50/IC50
nM
koff
s-1
kon
M-1s-1
pHTemp
°C
cAMP-specific 3',5'-cyclic phosphodiesterase 4B
(Homo sapiens (Human))
BDBM50412413
(CHEMBL486442)
Show SMILES CCn1ncc2c(NC3CCOCC3)c(cnc12)C(=O)N(C)Cc1ccccc1
Show InChI InChI=1S/C22H27N5O2/c1-3-27-21-18(14-24-27)20(25-17-9-11-29-12-10-17)19(13-23-21)22(28)26(2)15-16-7-5-4-6-8-16/h4-8,13-14,17H,3,9-12,15H2,1-2H3,(H,23,25)
n/an/a 50.1n/an/an/an/an/an/a
GlaxoSmithKline Medicines Research Centre
Curated by ChEMBL
Assay Description
Inhibition of human PDE4B in Sf9 cells
Bioorg Med Chem Lett 18: 4237-41 (2008)
Article DOI: 10.1016/j.bmcl.2008.05.052
BindingDB Entry DOI: 10.7270/Q2ZP47B3