BDBM50412600 CHEMBL468468
SMILES: CC1(C)[C@@H]2CC[C@@]1(CS(=O)(=O)N1CCN(CC1)c1ccc(cn1)C(F)(F)F)C1(C2)OCCO1
InChI Key: InChIKey=PDYTZVLHJHZVEC-UZLBHIALSA-N
Data: 1 IC50
Activity Spreadsheet -- Enzyme Inhibition Constant Data from BindingDB
Found 1 hit for monomerid = 50412600
Trg + Lig
Ki
nM
ΔG°
kcal/mole
IC50
nM
Kd
nM
EC50/IC50
nM
koff
s-1
kon
M-1s-1
pHTemp
°C
chemokine (C-X-C motif) receptor 3
(Homo sapiens (Human))
BDBM50412600
(CHEMBL468468)
Show SMILES CC1(C)[C@@H]2CC[C@@]1(CS(=O)(=O)N1CCN(CC1)c1ccc(cn1)C(F)(F)F)C1(C2)OCCO1 |r|
Show InChI InChI=1S/C22H30F3N3O4S/c1-19(2)16-5-6-20(19,21(13-16)31-11-12-32-21)15-33(29,30)28-9-7-27(8-10-28)18-4-3-17(14-26-18)22(23,24)25/h3-4,14,16H,5-13,15H2,1-2H3/t16-,20+/m1/s1
n/an/a 200n/an/an/an/an/an/a
GlaxoSmithKline
Curated by ChEMBL
Assay Description
Antagonist activity at human recombinant CXCR3 receptor expressed in CHO-K1 cells assessed as human IP10-induced calcium flux by FLIPR assay
Bioorg Med Chem Lett 19: 114-8 (2008)
Article DOI: 10.1016/j.bmcl.2008.11.008
BindingDB Entry DOI: 10.7270/Q29Z94R0