null
SMILES: Oc1ccc(Cl)cc1NC(=O)c1ccccc1O
InChI Key: InChIKey=DHARHZPJWBSJCZ-UHFFFAOYSA-N
Activity Spreadsheet -- Enzyme Inhibition Constant Data from BindingDB
Found 1 hit for monomerid = 50412630
Trg + Lig
Ki
nM
ΔG°
kcal/mole
IC50
nM
Kd
nM
EC50/IC50
nM
koff
s-1
kon
M-1s-1
pHTemp
°C
Calcium-activated potassium channel subunit alpha-1
(Homo sapiens (Human))
BDBM50412630
(CHEMBL524902)
Show SMILES Oc1ccc(Cl)cc1NC(=O)c1ccccc1O
Show InChI InChI=1S/C13H10ClNO3/c14-8-5-6-12(17)10(7-8)15-13(18)9-3-1-2-4-11(9)16/h1-7,16-17H,(H,15,18)
Reactome pathway
n/an/a 135n/an/an/an/an/an/a
Universit£ di Pisa
Curated by ChEMBL
Assay Description
Activation of BK channel-mediated vasorelaxation activity assessed as reduction in KCl-induced contractile tone
Bioorg Med Chem 17: 319-25 (2008)
Article DOI: 10.1016/j.bmc.2008.10.068
BindingDB Entry DOI: 10.7270/Q2P84D59