BDBM50412634 CHEMBL517012
SMILES: CCOC(=O)c1nnn(c1-c1ccc(cc1)[N+]([O-])=O)-c1ccc(Cl)cc1[N+]([O-])=O
InChI Key: InChIKey=LMSBWUMVFGCJNV-UHFFFAOYSA-N
Data: 1 IC50
Activity Spreadsheet -- Enzyme Inhibition Constant Data from BindingDB
Found 1 hit for monomerid = 50412634
Trg + Lig
Ki
nM
ΔG°
kcal/mole
IC50
nM
Kd
nM
EC50/IC50
nM
koff
s-1
kon
M-1s-1
pHTemp
°C
Calcium-activated potassium channel alpha/beta 1
(Homo sapiens (Human))
BDBM50412634
(CHEMBL517012)
Show SMILES CCOC(=O)c1nnn(c1-c1ccc(cc1)[N+]([O-])=O)-c1ccc(Cl)cc1[N+]([O-])=O
Show InChI InChI=1S/C17H12ClN5O6/c1-2-29-17(24)15-16(10-3-6-12(7-4-10)22(25)26)21(20-19-15)13-8-5-11(18)9-14(13)23(27)28/h3-9H,2H2,1H3
Reactome pathway
n/an/a 282n/an/an/an/an/an/a
Universit£ di Pisa
Curated by ChEMBL
Assay Description
Activation of BK channel-mediated vasorelaxation activity assessed as reduction in KCl-induced contractile tone
Bioorg Med Chem 17: 319-25 (2008)
Article DOI: 10.1016/j.bmc.2008.10.068
BindingDB Entry DOI: 10.7270/Q2P84D59