BDBM50412635 CHEMBL455306
SMILES: Oc1ccc(Cl)cc1NC(=O)c1cc(Cl)ccc1O
InChI Key: InChIKey=QCMHICCBYBKRCY-UHFFFAOYSA-N
Data: 1 IC50
Activity Spreadsheet -- Enzyme Inhibition Constant Data from BindingDB
Found 1 hit for monomerid = 50412635
Trg + Lig
Ki
nM
ΔG°
kcal/mole
IC50
nM
Kd
nM
EC50/IC50
nM
koff
s-1
kon
M-1s-1
pHTemp
°C
Calcium-activated potassium channel alpha/beta 1
(Homo sapiens (Human))
BDBM50412635
(CHEMBL455306)
Show SMILES Oc1ccc(Cl)cc1NC(=O)c1cc(Cl)ccc1O
Show InChI InChI=1S/C13H9Cl2NO3/c14-7-1-3-11(17)9(5-7)13(19)16-10-6-8(15)2-4-12(10)18/h1-6,17-18H,(H,16,19)
Reactome pathway
n/an/a 372n/an/an/an/an/an/a
Universit£ di Pisa
Curated by ChEMBL
Assay Description
Activation of BK channel-mediated vasorelaxation activity assessed as reduction in KCl-induced contractile tone
Bioorg Med Chem 17: 319-25 (2008)
Article DOI: 10.1016/j.bmc.2008.10.068
BindingDB Entry DOI: 10.7270/Q2P84D59